{"text_format":"1","workbook":"xlsx","n_sheets":10,"sheets":["Testarea","Growth Data","Contents","Data","Home","Early Years","High Needs Mainstream","Specialist Resourced Provision","Growth Funding","SRP Rates"],"not_rendered":{"charts":0,"images":2,"macros":1,"external_links":1,"defined_names":31,"comments":0,"pivot_tables":0},"unopened":[],"bounds":{"document_bytes":16777216,"sheet_cells":100000,"rows_first":2000,"rows_last":500,"rows_between":2000,"halvings":0,"cell_chars":16384,"cell_head_chars":4096},"cells_cut":0,"cells_raw":0,"read":"whole","date_system":"1900"}

{"sheet":"Testarea","index":0,"n_rows":209,"n_cols":35,"rows_kept":209,"cut":false,"hidden":true,"merged":[]}
["DfE","School name","Early years","Ref",{"$f":"SUM(E2:E169)","v":0},"SEN topup","Ref",{"$f":"SUM(H2:H169)","v":59176.6},"SEN max","Ref",{"$f":"SUM(K2:K169)","v":0},"SRP1pre£","Ref",{"$f":"SUM(N2:N169)","v":0},"SRP1post£","Ref",{"$f":"SUM(Q2:Q169)","v":0},"SRP2pre£","Ref",{"$f":"SUM(T2:T169)","v":-1231.5500000000002},"SRP2post£","Ref",{"$f":"SUM(W2:W169)","v":-1121.0900000000001},"Place check","Ref",{"$f":"SUM(Z2:Z169)","v":0},"Lower Threshold","Ref",{"$f":"SUM(AC2:AC169)","v":443},"Qual year","Ref",{"$f":"SUM(AF2:AF169)","v":28},"Upper Threshold","Ref",{"$f":"SUM(AI2:AI209)","v":31}]
[2001,"Horizon Primary Academy",0,0,{"$f":"C2-D2","v":0},0,null,{"$f":"ROUND(F2-G2,2)","v":0},0,null,{"$f":"ROUND(I2-J2,2)","v":0},0,null,{"$f":"ROUND(L2-M2,2)","v":0},0,null,{"$f":"ROUND(O2-P2,2)","v":0},0,0,{"$f":"ROUND(R2-S2,2)","v":0},0,0,{"$f":"ROUND(U2-V2,2)","v":0},null,null,{"$f":"X2-Y2","v":0},0,{"$f":"IF(ISERROR(VLOOKUP(A2+8860000,'Growth Data'!A:F,6,0)),0,VLOOKUP(A2+8860000,'Growth Data'!A:F,6,0))","v":0},{"$f":"IF(AD2=\"YES\",AA2-AB2,0)","v":0},"NO",{"$f":"IF(ISERROR(VLOOKUP(A2+8860000,'Growth Data'!A:C,3,0)),\"NO\",VLOOKUP(A2+8860000,'Growth Data'!A:C,3,0))","v":"NO"},{"$f":"IF(AD2=AE2,0,1)","v":0},0,{"$f":"IF(ISERROR(VLOOKUP(A2+8860000,'Growth Data'!A:G,7,0)),0,VLOOKUP(A2+8860000,'Growth Data'!A:G,7,0))","v":0},{"$f":"IF(AG2=AH2,0,1)","v":0}]
[2003,"Oaks Primary Academy",4.93,4.9300000000000006,0,0,null,{"$f":"ROUND(F3-G3,2)","v":0},0,null,{"$f":"ROUND(I3-J3,2)","v":0},0,null,0,0,null,0,0,0,0,0,0,0,null,null,0,0,{"$f":"IF(ISERROR(VLOOKUP(A3+8860000,'Growth Data'!A:F,6,0)),0,VLOOKUP(A3+8860000,'Growth Data'!A:F,6,0))","v":0},{"$f":"IF(AD3=\"YES\",AA3-AB3,0)","v":0},"NO",{"$f":"IF(ISERROR(VLOOKUP(A3+8860000,'Growth Data'!A:C,3,0)),\"NO\",VLOOKUP(A3+8860000,'Growth Data'!A:C,3,0))","v":"NO"},0,0,{"$f":"IF(ISERROR(VLOOKUP(A3+8860000,'Growth Data'!A:G,7,0)),0,VLOOKUP(A3+8860000,'Growth Data'!A:G,7,0))","v":0},{"$f":"IF(AG3=AH3,0,1)","v":0}]
[2004,"Tree Tops Primary Academy",5.18,5.1800000000000006,0,0,null,0,0,null,0,0,null,0,0,null,0,0,0,0,0,0,0,null,null,0,0,{"$f":"IF(ISERROR(VLOOKUP(A4+8860000,'Growth Data'!A:F,6,0)),0,VLOOKUP(A4+8860000,'Growth Data'!A:F,6,0))","v":0},0,"NO",{"$f":"IF(ISERROR(VLOOKUP(A4+8860000,'Growth Data'!A:C,3,0)),\"NO\",VLOOKUP(A4+8860000,'Growth Data'!A:C,3,0))","v":"NO"},0,0,{"$f":"IF(ISERROR(VLOOKUP(A4+8860000,'Growth Data'!A:G,7,0)),0,VLOOKUP(A4+8860000,'Growth Data'!A:G,7,0))","v":0},0]
[2006,"St James the Great Academy",5.0599999999999996,5.0600000000000005,0,0,null,0,0,null,0,0,null,0,0,null,0,0,0,0,0,0,0,null,null,0,0,{"$f":"IF(ISERROR(VLOOKUP(A5+8860000,'Growth Data'!A:F,6,0)),0,VLOOKUP(A5+8860000,'Growth Data'!A:F,6,0))","v":0},0,"NO",{"$f":"IF(ISERROR(VLOOKUP(A5+8860000,'Growth Data'!A:C,3,0)),\"NO\",VLOOKUP(A5+8860000,'Growth Data'!A:C,3,0))","v":"NO"},0,0,{"$f":"IF(ISERROR(VLOOKUP(A5+8860000,'Growth Data'!A:G,7,0)),0,VLOOKUP(A5+8860000,'Growth Data'!A:G,7,0))","v":0},0]
[2007,"Molehill Primary Academy",0,0,0,0,null,0,0,null,0,0,null,0,0,null,0,0,0,0,0,0,0,null,null,0,0,{"$f":"IF(ISERROR(VLOOKUP(A6+8860000,'Growth Data'!A:F,6,0)),0,VLOOKUP(A6+8860000,'Growth Data'!A:F,6,0))","v":0},0,"NO",{"$f":"IF(ISERROR(VLOOKUP(A6+8860000,'Growth Data'!A:C,3,0)),\"NO\",VLOOKUP(A6+8860000,'Growth Data'!A:C,3,0))","v":"NO"},0,0,{"$f":"IF(ISERROR(VLOOKUP(A6+8860000,'Growth Data'!A:G,7,0)),0,VLOOKUP(A6+8860000,'Growth Data'!A:G,7,0))","v":0},0]
[2008,"Tiger Primary School",0,0,0,0,null,0,0,null,0,0,null,0,0,null,0,0,0,0,0,0,0,null,null,0,0,{"$f":"IF(ISERROR(VLOOKUP(A7+8860000,'Growth Data'!A:F,6,0)),0,VLOOKUP(A7+8860000,'Growth Data'!A:F,6,0))","v":0},0,"NO",{"$f":"IF(ISERROR(VLOOKUP(A7+8860000,'Growth Data'!A:C,3,0)),\"NO\",VLOOKUP(A7+8860000,'Growth Data'!A:C,3,0))","v":"NO"},0,0,{"$f":"IF(ISERROR(VLOOKUP(A7+8860000,'Growth Data'!A:G,7,0)),0,VLOOKUP(A7+8860000,'Growth Data'!A:G,7,0))","v":0},0]
[2009,"Northdown Primary School",5.45,5.45,0,0,null,0,0,null,0,0,null,0,0,null,0,0,0,0,0,0,0,null,null,0,45,{"$f":"IF(ISERROR(VLOOKUP(A8+8860000,'Growth Data'!A:F,6,0)),0,VLOOKUP(A8+8860000,'Growth Data'!A:F,6,0))","v":0},45,"YES",{"$f":"IF(ISERROR(VLOOKUP(A8+8860000,'Growth Data'!A:C,3,0)),\"NO\",VLOOKUP(A8+8860000,'Growth Data'!A:C,3,0))","v":"NO"},1,60,{"$f":"IF(ISERROR(VLOOKUP(A8+8860000,'Growth Data'!A:G,7,0)),0,VLOOKUP(A8+8860000,'Growth Data'!A:G,7,0))","v":0},1]
[2010,"Newlands Primary School",0,0,0,0,null,0,0,null,0,0,null,0,0,null,0,0,0,0,0,0,0,null,null,0,0,{"$f":"IF(ISERROR(VLOOKUP(A9+8860000,'Growth Data'!A:F,6,0)),0,VLOOKUP(A9+8860000,'Growth Data'!A:F,6,0))","v":0},0,"NO",{"$f":"IF(ISERROR(VLOOKUP(A9+8860000,'Growth Data'!A:C,3,0)),\"NO\",VLOOKUP(A9+8860000,'Growth Data'!A:C,3,0))","v":"NO"},0,0,{"$f":"IF(ISERROR(VLOOKUP(A9+8860000,'Growth Data'!A:G,7,0)),0,VLOOKUP(A9+8860000,'Growth Data'!A:G,7,0))","v":0},0]
[2011,"Salmestone Primary School",4.97,4.9700000000000006,0,0,null,0,0,null,0,0,null,0,0,null,0,0,0,0,0,0,0,null,null,0,0,{"$f":"IF(ISERROR(VLOOKUP(A10+8860000,'Growth Data'!A:F,6,0)),0,VLOOKUP(A10+8860000,'Growth Data'!A:F,6,0))","v":0},0,"NO",{"$f":"IF(ISERROR(VLOOKUP(A10+8860000,'Growth Data'!A:C,3,0)),\"NO\",VLOOKUP(A10+8860000,'Growth Data'!A:C,3,0))","v":"NO"},0,0,{"$f":"IF(ISERROR(VLOOKUP(A10+8860000,'Growth Data'!A:G,7,0)),0,VLOOKUP(A10+8860000,'Growth Data'!A:G,7,0))","v":0},0]
[2013,"Hersden Village Primary School",0,0,0,0,null,0,0,null,0,0,null,0,0,null,0,0,0,0,0,0,0,null,null,0,0,{"$f":"IF(ISERROR(VLOOKUP(A11+8860000,'Growth Data'!A:F,6,0)),0,VLOOKUP(A11+8860000,'Growth Data'!A:F,6,0))","v":0},0,"NO",{"$f":"IF(ISERROR(VLOOKUP(A11+8860000,'Growth Data'!A:C,3,0)),\"NO\",VLOOKUP(A11+8860000,'Growth Data'!A:C,3,0))","v":"NO"},0,0,{"$f":"IF(ISERROR(VLOOKUP(A11+8860000,'Growth Data'!A:G,7,0)),0,VLOOKUP(A11+8860000,'Growth Data'!A:G,7,0))","v":0},0]
[2014,"St Laurence in Thanet C of E Junior Academy",0,0,0,0,null,0,0,null,0,0,null,0,0,null,0,0,0,0,0,0,0,null,null,0,0,{"$f":"IF(ISERROR(VLOOKUP(A12+8860000,'Growth Data'!A:F,6,0)),0,VLOOKUP(A12+8860000,'Growth Data'!A:F,6,0))","v":0},0,"NO",{"$f":"IF(ISERROR(VLOOKUP(A12+8860000,'Growth Data'!A:C,3,0)),\"NO\",VLOOKUP(A12+8860000,'Growth Data'!A:C,3,0))","v":"NO"},0,0,{"$f":"IF(ISERROR(VLOOKUP(A12+8860000,'Growth Data'!A:G,7,0)),0,VLOOKUP(A12+8860000,'Growth Data'!A:G,7,0))","v":0},0]
[2015,"Dame Janet Primary Academy",5.18,5.1800000000000006,0,0,null,0,0,null,0,0,null,0,0,null,0,0,0,0,0,0,0,null,null,0,0,{"$f":"IF(ISERROR(VLOOKUP(A13+8860000,'Growth Data'!A:F,6,0)),0,VLOOKUP(A13+8860000,'Growth Data'!A:F,6,0))","v":0},0,"NO",{"$f":"IF(ISERROR(VLOOKUP(A13+8860000,'Growth Data'!A:C,3,0)),\"NO\",VLOOKUP(A13+8860000,'Growth Data'!A:C,3,0))","v":"NO"},0,0,{"$f":"IF(ISERROR(VLOOKUP(A13+8860000,'Growth Data'!A:G,7,0)),0,VLOOKUP(A13+8860000,'Growth Data'!A:G,7,0))","v":0},0]
[2017,"Drapers Mills Primary Academy",5.34,5.3400000000000007,0,0,null,0,0,null,0,0,null,0,0,null,0,0,0,0,0,0,0,null,null,0,79,{"$f":"IF(ISERROR(VLOOKUP(A14+8860000,'Growth Data'!A:F,6,0)),0,VLOOKUP(A14+8860000,'Growth Data'!A:F,6,0))","v":0},79,"YES",{"$f":"IF(ISERROR(VLOOKUP(A14+8860000,'Growth Data'!A:C,3,0)),\"NO\",VLOOKUP(A14+8860000,'Growth Data'!A:C,3,0))","v":"NO"},1,90,{"$f":"IF(ISERROR(VLOOKUP(A14+8860000,'Growth Data'!A:G,7,0)),0,VLOOKUP(A14+8860000,'Growth Data'!A:G,7,0))","v":0},1]
[2018,"Temple Grove Academy",4.8600000000000003,4.8600000000000003,0,0,null,0,0,null,0,0,null,0,0,null,0,0,0,0,0,0,0,null,null,0,0,{"$f":"IF(ISERROR(VLOOKUP(A15+8860000,'Growth Data'!A:F,6,0)),0,VLOOKUP(A15+8860000,'Growth Data'!A:F,6,0))","v":0},0,"NO",{"$f":"IF(ISERROR(VLOOKUP(A15+8860000,'Growth Data'!A:C,3,0)),\"NO\",VLOOKUP(A15+8860000,'Growth Data'!A:C,3,0))","v":"NO"},0,0,{"$f":"IF(ISERROR(VLOOKUP(A15+8860000,'Growth Data'!A:G,7,0)),0,VLOOKUP(A15+8860000,'Growth Data'!A:G,7,0))","v":0},0]
[2019,"Chantry Community Academy",5.16,5.16,0,0,null,0,0,null,0,0,null,0,0,null,0,0,0,0,0,0,0,null,null,0,30,{"$f":"IF(ISERROR(VLOOKUP(A16+8860000,'Growth Data'!A:F,6,0)),0,VLOOKUP(A16+8860000,'Growth Data'!A:F,6,0))","v":0},30,"YES",{"$f":"IF(ISERROR(VLOOKUP(A16+8860000,'Growth Data'!A:C,3,0)),\"NO\",VLOOKUP(A16+8860000,'Growth Data'!A:C,3,0))","v":"NO"},1,60,{"$f":"IF(ISERROR(VLOOKUP(A16+8860000,'Growth Data'!A:G,7,0)),0,VLOOKUP(A16+8860000,'Growth Data'!A:G,7,0))","v":0},1]
[2020,"Christ Church CEJ School, Ramsgate",0,0,0,0,null,0,0,null,0,0,null,0,0,null,0,0,0,0,0,0,0,null,null,0,0,{"$f":"IF(ISERROR(VLOOKUP(A17+8860000,'Growth Data'!A:F,6,0)),0,VLOOKUP(A17+8860000,'Growth Data'!A:F,6,0))","v":0},0,"NO",{"$f":"IF(ISERROR(VLOOKUP(A17+8860000,'Growth Data'!A:C,3,0)),\"NO\",VLOOKUP(A17+8860000,'Growth Data'!A:C,3,0))","v":"NO"},0,0,{"$f":"IF(ISERROR(VLOOKUP(A17+8860000,'Growth Data'!A:G,7,0)),0,VLOOKUP(A17+8860000,'Growth Data'!A:G,7,0))","v":0},0]
[2021,"Kemsley Primary Academy",4.8499999999999996,4.8500000000000005,0,0,null,0,0,null,0,0,null,0,0,null,0,0,0,0,0,0,0,null,null,0,0,{"$f":"IF(ISERROR(VLOOKUP(A18+8860000,'Growth Data'!A:F,6,0)),0,VLOOKUP(A18+8860000,'Growth Data'!A:F,6,0))","v":0},0,"NO",{"$f":"IF(ISERROR(VLOOKUP(A18+8860000,'Growth Data'!A:C,3,0)),\"NO\",VLOOKUP(A18+8860000,'Growth Data'!A:C,3,0))","v":"NO"},0,0,{"$f":"IF(ISERROR(VLOOKUP(A18+8860000,'Growth Data'!A:G,7,0)),0,VLOOKUP(A18+8860000,'Growth Data'!A:G,7,0))","v":0},0]
[2022,"Milton Court Primary Academy",5.21,5.2100000000000009,0,0,null,0,0,null,0,0,null,0,0,null,0,0,0,0,0,0,0,null,null,0,0,{"$f":"IF(ISERROR(VLOOKUP(A19+8860000,'Growth Data'!A:F,6,0)),0,VLOOKUP(A19+8860000,'Growth Data'!A:F,6,0))","v":0},0,"NO",{"$f":"IF(ISERROR(VLOOKUP(A19+8860000,'Growth Data'!A:C,3,0)),\"NO\",VLOOKUP(A19+8860000,'Growth Data'!A:C,3,0))","v":"NO"},0,0,{"$f":"IF(ISERROR(VLOOKUP(A19+8860000,'Growth Data'!A:G,7,0)),0,VLOOKUP(A19+8860000,'Growth Data'!A:G,7,0))","v":0},0]
[2023,"Temple Ewell CEP School",0,0,0,2069.0300000000002,null,2069.0300000000002,0,null,0,0,null,0,0,null,0,0,0,0,0,0,0,null,null,0,0,{"$f":"IF(ISERROR(VLOOKUP(A20+8860000,'Growth Data'!A:F,6,0)),0,VLOOKUP(A20+8860000,'Growth Data'!A:F,6,0))","v":0},0,"NO",{"$f":"IF(ISERROR(VLOOKUP(A20+8860000,'Growth Data'!A:C,3,0)),\"NO\",VLOOKUP(A20+8860000,'Growth Data'!A:C,3,0))","v":"NO"},0,0,{"$f":"IF(ISERROR(VLOOKUP(A20+8860000,'Growth Data'!A:G,7,0)),0,VLOOKUP(A20+8860000,'Growth Data'!A:G,7,0))","v":0},0]
[2024,"Copperfield Academy",4.8600000000000003,4.8600000000000003,0,0,null,0,0,null,0,0,null,0,0,null,0,0,0,0,0,0,0,null,null,0,0,{"$f":"IF(ISERROR(VLOOKUP(A21+8860000,'Growth Data'!A:F,6,0)),0,VLOOKUP(A21+8860000,'Growth Data'!A:F,6,0))","v":87},0,"NO",{"$f":"IF(ISERROR(VLOOKUP(A21+8860000,'Growth Data'!A:C,3,0)),\"NO\",VLOOKUP(A21+8860000,'Growth Data'!A:C,3,0))","v":"YES"},1,0,{"$f":"IF(ISERROR(VLOOKUP(A21+8860000,'Growth Data'!A:G,7,0)),0,VLOOKUP(A21+8860000,'Growth Data'!A:G,7,0))","v":90},1]
[2025,"Wells Free School, The",0,0,0,1559.07,null,1559.07,0,null,0,0,null,0,0,null,0,0,0,0,0,0,0,null,null,0,0,{"$f":"IF(ISERROR(VLOOKUP(A22+8860000,'Growth Data'!A:F,6,0)),0,VLOOKUP(A22+8860000,'Growth Data'!A:F,6,0))","v":0},0,"NO",{"$f":"IF(ISERROR(VLOOKUP(A22+8860000,'Growth Data'!A:C,3,0)),\"NO\",VLOOKUP(A22+8860000,'Growth Data'!A:C,3,0))","v":"NO"},0,0,{"$f":"IF(ISERROR(VLOOKUP(A22+8860000,'Growth Data'!A:G,7,0)),0,VLOOKUP(A22+8860000,'Growth Data'!A:G,7,0))","v":0},0]
[2026,"Petham Primary School",0,0,0,3688.14,null,3688.14,0,null,0,0,null,0,0,null,0,0,0,0,0,0,0,null,null,0,0,{"$f":"IF(ISERROR(VLOOKUP(A23+8860000,'Growth Data'!A:F,6,0)),0,VLOOKUP(A23+8860000,'Growth Data'!A:F,6,0))","v":0},0,"NO",{"$f":"IF(ISERROR(VLOOKUP(A23+8860000,'Growth Data'!A:C,3,0)),\"NO\",VLOOKUP(A23+8860000,'Growth Data'!A:C,3,0))","v":"NO"},0,0,{"$f":"IF(ISERROR(VLOOKUP(A23+8860000,'Growth Data'!A:G,7,0)),0,VLOOKUP(A23+8860000,'Growth Data'!A:G,7,0))","v":0},0]
[2027,"Archbishop Courtenay Primary School",5.08,5.08,0,0,null,0,0,null,0,0,null,0,0,null,0,0,0,0,0,0,0,null,null,0,0,{"$f":"IF(ISERROR(VLOOKUP(A24+8860000,'Growth Data'!A:F,6,0)),0,VLOOKUP(A24+8860000,'Growth Data'!A:F,6,0))","v":0},0,"NO",{"$f":"IF(ISERROR(VLOOKUP(A24+8860000,'Growth Data'!A:C,3,0)),\"NO\",VLOOKUP(A24+8860000,'Growth Data'!A:C,3,0))","v":"NO"},0,0,{"$f":"IF(ISERROR(VLOOKUP(A24+8860000,'Growth Data'!A:G,7,0)),0,VLOOKUP(A24+8860000,'Growth Data'!A:G,7,0))","v":0},0]
[2028,"Cliftonville Primary School",5.17,5.1700000000000008,0,0,null,0,0,null,0,0,null,0,0,null,0,0,0,0,0,0,0,null,null,0,0,{"$f":"IF(ISERROR(VLOOKUP(A25+8860000,'Growth Data'!A:F,6,0)),0,VLOOKUP(A25+8860000,'Growth Data'!A:F,6,0))","v":90},0,"NO",{"$f":"IF(ISERROR(VLOOKUP(A25+8860000,'Growth Data'!A:C,3,0)),\"NO\",VLOOKUP(A25+8860000,'Growth Data'!A:C,3,0))","v":"YES"},1,0,{"$f":"IF(ISERROR(VLOOKUP(A25+8860000,'Growth Data'!A:G,7,0)),0,VLOOKUP(A25+8860000,'Growth Data'!A:G,7,0))","v":120},1]
[2029,"Tymberwood Academy",5.14,5.1400000000000006,0,0,null,0,0,null,0,0,null,0,0,null,0,0,0,0,0,0,0,null,null,0,0,{"$f":"IF(ISERROR(VLOOKUP(A26+8860000,'Growth Data'!A:F,6,0)),0,VLOOKUP(A26+8860000,'Growth Data'!A:F,6,0))","v":0},0,"NO",{"$f":"IF(ISERROR(VLOOKUP(A26+8860000,'Growth Data'!A:C,3,0)),\"NO\",VLOOKUP(A26+8860000,'Growth Data'!A:C,3,0))","v":"NO"},0,0,{"$f":"IF(ISERROR(VLOOKUP(A26+8860000,'Growth Data'!A:G,7,0)),0,VLOOKUP(A26+8860000,'Growth Data'!A:G,7,0))","v":0},0]
[2030,"Valley Invicta Primary School at Aylesford",0,0,0,0,null,0,0,null,0,0,null,0,0,null,0,0,0,0,0,0,0,null,null,0,0,{"$f":"IF(ISERROR(VLOOKUP(A27+8860000,'Growth Data'!A:F,6,0)),0,VLOOKUP(A27+8860000,'Growth Data'!A:F,6,0))","v":0},0,"NO",{"$f":"IF(ISERROR(VLOOKUP(A27+8860000,'Growth Data'!A:C,3,0)),\"NO\",VLOOKUP(A27+8860000,'Growth Data'!A:C,3,0))","v":"NO"},0,0,{"$f":"IF(ISERROR(VLOOKUP(A27+8860000,'Growth Data'!A:G,7,0)),0,VLOOKUP(A27+8860000,'Growth Data'!A:G,7,0))","v":0},0]
[2031,"Morehall Academy",0,0,0,0,null,0,0,null,0,0,null,0,0,null,0,0,0,0,0,0,0,null,null,0,0,{"$f":"IF(ISERROR(VLOOKUP(A28+8860000,'Growth Data'!A:F,6,0)),0,VLOOKUP(A28+8860000,'Growth Data'!A:F,6,0))","v":0},0,"NO",{"$f":"IF(ISERROR(VLOOKUP(A28+8860000,'Growth Data'!A:C,3,0)),\"NO\",VLOOKUP(A28+8860000,'Growth Data'!A:C,3,0))","v":"NO"},0,0,{"$f":"IF(ISERROR(VLOOKUP(A28+8860000,'Growth Data'!A:G,7,0)),0,VLOOKUP(A28+8860000,'Growth Data'!A:G,7,0))","v":0},0]
[2032,"Richmond Academy",5.36,5.36,0,0,null,0,0,null,0,0,null,0,0,null,0,0,0,0,0,0,0,null,null,0,0,{"$f":"IF(ISERROR(VLOOKUP(A29+8860000,'Growth Data'!A:F,6,0)),0,VLOOKUP(A29+8860000,'Growth Data'!A:F,6,0))","v":0},0,"NO",{"$f":"IF(ISERROR(VLOOKUP(A29+8860000,'Growth Data'!A:C,3,0)),\"NO\",VLOOKUP(A29+8860000,'Growth Data'!A:C,3,0))","v":"NO"},0,0,{"$f":"IF(ISERROR(VLOOKUP(A29+8860000,'Growth Data'!A:G,7,0)),0,VLOOKUP(A29+8860000,'Growth Data'!A:G,7,0))","v":0},0]
[2033,"Pilgrims' Way Primary School",4.97,4.9700000000000006,0,0,null,0,0,null,0,0,null,0,0,null,0,0,0,0,0,0,0,null,null,0,0,{"$f":"IF(ISERROR(VLOOKUP(A30+8860000,'Growth Data'!A:F,6,0)),0,VLOOKUP(A30+8860000,'Growth Data'!A:F,6,0))","v":0},0,"NO",{"$f":"IF(ISERROR(VLOOKUP(A30+8860000,'Growth Data'!A:C,3,0)),\"NO\",VLOOKUP(A30+8860000,'Growth Data'!A:C,3,0))","v":"NO"},0,0,{"$f":"IF(ISERROR(VLOOKUP(A30+8860000,'Growth Data'!A:G,7,0)),0,VLOOKUP(A30+8860000,'Growth Data'!A:G,7,0))","v":0},0]
[2034,"Thistle Hill Academy",0,0,0,0,null,0,0,null,0,0,null,0,0,null,0,0,0,0,0,0,0,null,null,0,0,{"$f":"IF(ISERROR(VLOOKUP(A31+8860000,'Growth Data'!A:F,6,0)),0,VLOOKUP(A31+8860000,'Growth Data'!A:F,6,0))","v":30},0,"NO",{"$f":"IF(ISERROR(VLOOKUP(A31+8860000,'Growth Data'!A:C,3,0)),\"NO\",VLOOKUP(A31+8860000,'Growth Data'!A:C,3,0))","v":"YES"},1,0,{"$f":"IF(ISERROR(VLOOKUP(A31+8860000,'Growth Data'!A:G,7,0)),0,VLOOKUP(A31+8860000,'Growth Data'!A:G,7,0))","v":60},1]
[2036,"Valley Invicta Primary School at Leybourne Chase",0,0,0,1983.78,null,1983.78,0,null,0,0,null,0,0,null,0,0,0,0,0,0,0,null,null,0,0,{"$f":"IF(ISERROR(VLOOKUP(A32+8860000,'Growth Data'!A:F,6,0)),0,VLOOKUP(A32+8860000,'Growth Data'!A:F,6,0))","v":20},0,"NO",{"$f":"IF(ISERROR(VLOOKUP(A32+8860000,'Growth Data'!A:C,3,0)),\"NO\",VLOOKUP(A32+8860000,'Growth Data'!A:C,3,0))","v":"YES"},1,0,{"$f":"IF(ISERROR(VLOOKUP(A32+8860000,'Growth Data'!A:G,7,0)),0,VLOOKUP(A32+8860000,'Growth Data'!A:G,7,0))","v":30},1]
[2037,"Valley Invicta Primary School at Holborough Lakes",0,0,0,0,null,0,0,null,0,0,null,0,0,null,0,0,0,0,0,0,0,null,null,0,0,{"$f":"IF(ISERROR(VLOOKUP(A33+8860000,'Growth Data'!A:F,6,0)),0,VLOOKUP(A33+8860000,'Growth Data'!A:F,6,0))","v":15},0,"NO",{"$f":"IF(ISERROR(VLOOKUP(A33+8860000,'Growth Data'!A:C,3,0)),\"NO\",VLOOKUP(A33+8860000,'Growth Data'!A:C,3,0))","v":"YES"},1,0,{"$f":"IF(ISERROR(VLOOKUP(A33+8860000,'Growth Data'!A:G,7,0)),0,VLOOKUP(A33+8860000,'Growth Data'!A:G,7,0))","v":30},1]
[2038,"Valley Invicta Primary School at Kings Hill",0,0,{"$f":"C34-D34","v":0},2530.75,null,2530.75,0,null,0,0,null,{"$f":"ROUND(L34-M34,2)","v":0},0,null,{"$f":"ROUND(O34-P34,2)","v":0},0,0,{"$f":"ROUND(R34-S34,2)","v":0},0,0,{"$f":"ROUND(U34-V34,2)","v":0},null,null,{"$f":"X34-Y34","v":0},0,{"$f":"IF(ISERROR(VLOOKUP(A34+8860000,'Growth Data'!A:F,6,0)),0,VLOOKUP(A34+8860000,'Growth Data'!A:F,6,0))","v":15},0,"NO",{"$f":"IF(ISERROR(VLOOKUP(A34+8860000,'Growth Data'!A:C,3,0)),\"NO\",VLOOKUP(A34+8860000,'Growth Data'!A:C,3,0))","v":"YES"},{"$f":"IF(AD34=AE34,0,1)","v":1},0,{"$f":"IF(ISERROR(VLOOKUP(A34+8860000,'Growth Data'!A:G,7,0)),0,VLOOKUP(A34+8860000,'Growth Data'!A:G,7,0))","v":30},1]
[2039,"Martello Grove Academy",0,0,0,0,null,0,0,null,0,0,null,0,0,null,0,0,0,0,0,0,0,null,null,0,0,{"$f":"IF(ISERROR(VLOOKUP(A35+8860000,'Growth Data'!A:F,6,0)),0,VLOOKUP(A35+8860000,'Growth Data'!A:F,6,0))","v":18},0,"NO",{"$f":"IF(ISERROR(VLOOKUP(A35+8860000,'Growth Data'!A:C,3,0)),\"NO\",VLOOKUP(A35+8860000,'Growth Data'!A:C,3,0))","v":"YES"},1,0,{"$f":"IF(ISERROR(VLOOKUP(A35+8860000,'Growth Data'!A:G,7,0)),0,VLOOKUP(A35+8860000,'Growth Data'!A:G,7,0))","v":30},1]
[2041,"Holy Family Catholic Primary School, The",0,0,0,0,null,0,0,null,0,0,null,0,0,null,0,0,0,0,0,0,0,null,null,0,0,{"$f":"IF(ISERROR(VLOOKUP(A36+8860000,'Growth Data'!A:F,6,0)),0,VLOOKUP(A36+8860000,'Growth Data'!A:F,6,0))","v":0},0,"NO",{"$f":"IF(ISERROR(VLOOKUP(A36+8860000,'Growth Data'!A:C,3,0)),\"NO\",VLOOKUP(A36+8860000,'Growth Data'!A:C,3,0))","v":"NO"},0,0,{"$f":"IF(ISERROR(VLOOKUP(A36+8860000,'Growth Data'!A:G,7,0)),0,VLOOKUP(A36+8860000,'Growth Data'!A:G,7,0))","v":0},0]
[2043,"Jubilee Primary School",0,0,0,0,null,0,0,null,0,0,null,0,0,null,0,0,0,0,0,0,0,null,null,0,0,{"$f":"IF(ISERROR(VLOOKUP(A37+8860000,'Growth Data'!A:F,6,0)),0,VLOOKUP(A37+8860000,'Growth Data'!A:F,6,0))","v":0},0,"NO",{"$f":"IF(ISERROR(VLOOKUP(A37+8860000,'Growth Data'!A:C,3,0)),\"NO\",VLOOKUP(A37+8860000,'Growth Data'!A:C,3,0))","v":"NO"},0,0,{"$f":"IF(ISERROR(VLOOKUP(A37+8860000,'Growth Data'!A:G,7,0)),0,VLOOKUP(A37+8860000,'Growth Data'!A:G,7,0))","v":0},0]
[2045,"Skinners' Kent Primary School",0,0,0,2270.02,null,2270.02,0,null,0,0,null,0,0,null,0,0,0,0,0,0,0,null,null,0,0,{"$f":"IF(ISERROR(VLOOKUP(A38+8860000,'Growth Data'!A:F,6,0)),0,VLOOKUP(A38+8860000,'Growth Data'!A:F,6,0))","v":0},0,"NO",{"$f":"IF(ISERROR(VLOOKUP(A38+8860000,'Growth Data'!A:C,3,0)),\"NO\",VLOOKUP(A38+8860000,'Growth Data'!A:C,3,0))","v":"NO"},0,0,{"$f":"IF(ISERROR(VLOOKUP(A38+8860000,'Growth Data'!A:G,7,0)),0,VLOOKUP(A38+8860000,'Growth Data'!A:G,7,0))","v":0},0]
[2047,"Knockhall Academy",4.8099999999999996,4.8100000000000005,0,0,null,0,0,null,0,0,null,0,0,null,0,0,0,0,0,0,0,null,null,0,60,{"$f":"IF(ISERROR(VLOOKUP(A39+8860000,'Growth Data'!A:F,6,0)),0,VLOOKUP(A39+8860000,'Growth Data'!A:F,6,0))","v":0},60,"YES",{"$f":"IF(ISERROR(VLOOKUP(A39+8860000,'Growth Data'!A:C,3,0)),\"NO\",VLOOKUP(A39+8860000,'Growth Data'!A:C,3,0))","v":"NO"},1,90,{"$f":"IF(ISERROR(VLOOKUP(A39+8860000,'Growth Data'!A:G,7,0)),0,VLOOKUP(A39+8860000,'Growth Data'!A:G,7,0))","v":0},1]
[2048,"Reculver C of E Primary School",0,0,0,0,null,0,0,null,0,0,null,0,0,null,0,0,0,0,0,0,0,null,null,0,0,{"$f":"IF(ISERROR(VLOOKUP(A40+8860000,'Growth Data'!A:F,6,0)),0,VLOOKUP(A40+8860000,'Growth Data'!A:F,6,0))","v":0},0,"NO",{"$f":"IF(ISERROR(VLOOKUP(A40+8860000,'Growth Data'!A:C,3,0)),\"NO\",VLOOKUP(A40+8860000,'Growth Data'!A:C,3,0))","v":"NO"},0,0,{"$f":"IF(ISERROR(VLOOKUP(A40+8860000,'Growth Data'!A:G,7,0)),0,VLOOKUP(A40+8860000,'Growth Data'!A:G,7,0))","v":0},0]
[2049,"Rosherville Church of England Academy",0,0,0,0,null,0,0,null,0,0,null,0,0,null,0,0,0,0,0,0,0,null,null,0,0,{"$f":"IF(ISERROR(VLOOKUP(A41+8860000,'Growth Data'!A:F,6,0)),0,VLOOKUP(A41+8860000,'Growth Data'!A:F,6,0))","v":0},0,"NO",{"$f":"IF(ISERROR(VLOOKUP(A41+8860000,'Growth Data'!A:C,3,0)),\"NO\",VLOOKUP(A41+8860000,'Growth Data'!A:C,3,0))","v":"NO"},0,0,{"$f":"IF(ISERROR(VLOOKUP(A41+8860000,'Growth Data'!A:G,7,0)),0,VLOOKUP(A41+8860000,'Growth Data'!A:G,7,0))","v":0},0]
[2051,"St Mary of Charity CofE (Aided) Primary School",0,0,0,0,null,0,0,null,0,0,null,0,0,null,0,0,0,0,0,0,0,null,null,0,0,{"$f":"IF(ISERROR(VLOOKUP(A42+8860000,'Growth Data'!A:F,6,0)),0,VLOOKUP(A42+8860000,'Growth Data'!A:F,6,0))","v":0},0,"NO",{"$f":"IF(ISERROR(VLOOKUP(A42+8860000,'Growth Data'!A:C,3,0)),\"NO\",VLOOKUP(A42+8860000,'Growth Data'!A:C,3,0))","v":"NO"},0,0,{"$f":"IF(ISERROR(VLOOKUP(A42+8860000,'Growth Data'!A:G,7,0)),0,VLOOKUP(A42+8860000,'Growth Data'!A:G,7,0))","v":0},0]
[2052,"Kennington C of E Academy",0,0,0,0,null,0,0,null,0,0,null,0,0,null,0,0,0,0,0,0,0,null,null,0,0,{"$f":"IF(ISERROR(VLOOKUP(A43+8860000,'Growth Data'!A:F,6,0)),0,VLOOKUP(A43+8860000,'Growth Data'!A:F,6,0))","v":0},0,"NO",{"$f":"IF(ISERROR(VLOOKUP(A43+8860000,'Growth Data'!A:C,3,0)),\"NO\",VLOOKUP(A43+8860000,'Growth Data'!A:C,3,0))","v":"NO"},0,0,{"$f":"IF(ISERROR(VLOOKUP(A43+8860000,'Growth Data'!A:G,7,0)),0,VLOOKUP(A43+8860000,'Growth Data'!A:G,7,0))","v":0},0]
[2054,"St Edward's Catholic Primary School",0,0,0,0,null,0,0,null,0,0,null,0,0,null,0,0,0,0,0,0,0,null,null,0,0,{"$f":"IF(ISERROR(VLOOKUP(A44+8860000,'Growth Data'!A:F,6,0)),0,VLOOKUP(A44+8860000,'Growth Data'!A:F,6,0))","v":0},0,"NO",{"$f":"IF(ISERROR(VLOOKUP(A44+8860000,'Growth Data'!A:C,3,0)),\"NO\",VLOOKUP(A44+8860000,'Growth Data'!A:C,3,0))","v":"NO"},0,0,{"$f":"IF(ISERROR(VLOOKUP(A44+8860000,'Growth Data'!A:G,7,0)),0,VLOOKUP(A44+8860000,'Growth Data'!A:G,7,0))","v":0},0]
[2055,"Lansdowne Primary School",0,0,0,0,null,0,0,null,0,0,null,0,0,null,0,0,0,0,0,0,0,null,null,0,30,{"$f":"IF(ISERROR(VLOOKUP(A45+8860000,'Growth Data'!A:F,6,0)),0,VLOOKUP(A45+8860000,'Growth Data'!A:F,6,0))","v":30},0,"YES",{"$f":"IF(ISERROR(VLOOKUP(A45+8860000,'Growth Data'!A:C,3,0)),\"NO\",VLOOKUP(A45+8860000,'Growth Data'!A:C,3,0))","v":"YES"},0,60,{"$f":"IF(ISERROR(VLOOKUP(A45+8860000,'Growth Data'!A:G,7,0)),0,VLOOKUP(A45+8860000,'Growth Data'!A:G,7,0))","v":60},0]
[2058,"Charlton CofE Primary School",0,0,0,0,null,0,0,null,0,0,null,0,0,null,0,0,0,0,0,0,0,null,null,0,0,{"$f":"IF(ISERROR(VLOOKUP(A46+8860000,'Growth Data'!A:F,6,0)),0,VLOOKUP(A46+8860000,'Growth Data'!A:F,6,0))","v":0},0,"NO",{"$f":"IF(ISERROR(VLOOKUP(A46+8860000,'Growth Data'!A:C,3,0)),\"NO\",VLOOKUP(A46+8860000,'Growth Data'!A:C,3,0))","v":"NO"},0,0,{"$f":"IF(ISERROR(VLOOKUP(A46+8860000,'Growth Data'!A:G,7,0)),0,VLOOKUP(A46+8860000,'Growth Data'!A:G,7,0))","v":0},0]
[2059,"Lydd Primary School",4.8099999999999996,4.8100000000000005,0,0,null,0,0,null,0,0,null,0,0,null,0,0,0,0,0,0,0,null,null,0,0,{"$f":"IF(ISERROR(VLOOKUP(A47+8860000,'Growth Data'!A:F,6,0)),0,VLOOKUP(A47+8860000,'Growth Data'!A:F,6,0))","v":0},0,"NO",{"$f":"IF(ISERROR(VLOOKUP(A47+8860000,'Growth Data'!A:C,3,0)),\"NO\",VLOOKUP(A47+8860000,'Growth Data'!A:C,3,0))","v":"NO"},0,0,{"$f":"IF(ISERROR(VLOOKUP(A47+8860000,'Growth Data'!A:G,7,0)),0,VLOOKUP(A47+8860000,'Growth Data'!A:G,7,0))","v":0},0]
[2060,"Beaver Green Primary School",5.14,5.1400000000000006,0,0,null,0,0,null,0,0,null,0,0,null,0,0,0,0,0,0,0,null,null,0,0,{"$f":"IF(ISERROR(VLOOKUP(A48+8860000,'Growth Data'!A:F,6,0)),0,VLOOKUP(A48+8860000,'Growth Data'!A:F,6,0))","v":0},0,"NO",{"$f":"IF(ISERROR(VLOOKUP(A48+8860000,'Growth Data'!A:C,3,0)),\"NO\",VLOOKUP(A48+8860000,'Growth Data'!A:C,3,0))","v":"NO"},0,0,{"$f":"IF(ISERROR(VLOOKUP(A48+8860000,'Growth Data'!A:G,7,0)),0,VLOOKUP(A48+8860000,'Growth Data'!A:G,7,0))","v":0},0]
[2061,"Finberry Primary School",0,0,0,0,null,0,0,null,0,0,null,0,0,null,0,0,0,0,0,0,0,null,null,0,0,{"$f":"IF(ISERROR(VLOOKUP(A49+8860000,'Growth Data'!A:F,6,0)),0,VLOOKUP(A49+8860000,'Growth Data'!A:F,6,0))","v":21},0,"NO",{"$f":"IF(ISERROR(VLOOKUP(A49+8860000,'Growth Data'!A:C,3,0)),\"NO\",VLOOKUP(A49+8860000,'Growth Data'!A:C,3,0))","v":"YES"},1,0,{"$f":"IF(ISERROR(VLOOKUP(A49+8860000,'Growth Data'!A:G,7,0)),0,VLOOKUP(A49+8860000,'Growth Data'!A:G,7,0))","v":30},1]
[2063,"Istead Rise Primary School",0,0,0,0,null,0,0,null,0,0,null,0,0,null,0,0,0,0,0,0,0,null,null,0,48,{"$f":"IF(ISERROR(VLOOKUP(A50+8860000,'Growth Data'!A:F,6,0)),0,VLOOKUP(A50+8860000,'Growth Data'!A:F,6,0))","v":0},48,"YES",{"$f":"IF(ISERROR(VLOOKUP(A50+8860000,'Growth Data'!A:C,3,0)),\"NO\",VLOOKUP(A50+8860000,'Growth Data'!A:C,3,0))","v":"NO"},1,60,{"$f":"IF(ISERROR(VLOOKUP(A50+8860000,'Growth Data'!A:G,7,0)),0,VLOOKUP(A50+8860000,'Growth Data'!A:G,7,0))","v":0},1]
[2064,"Ramsgate Free School",0,0,0,465.24,null,465.24,0,null,0,0,null,0,0,null,0,0,0,0,0,0,0,null,null,0,0,{"$f":"IF(ISERROR(VLOOKUP(A51+8860000,'Growth Data'!A:F,6,0)),0,VLOOKUP(A51+8860000,'Growth Data'!A:F,6,0))","v":0},0,"NO",{"$f":"IF(ISERROR(VLOOKUP(A51+8860000,'Growth Data'!A:C,3,0)),\"NO\",VLOOKUP(A51+8860000,'Growth Data'!A:C,3,0))","v":"NO"},0,0,{"$f":"IF(ISERROR(VLOOKUP(A51+8860000,'Growth Data'!A:G,7,0)),0,VLOOKUP(A51+8860000,'Growth Data'!A:G,7,0))","v":0},0]
[2069,"Dartford Primary Academy",4.8099999999999996,4.8100000000000005,0,0,null,0,0,null,0,0,null,0,0,null,0,0,0,0,0,0,0,null,null,0,0,{"$f":"IF(ISERROR(VLOOKUP(A52+8860000,'Growth Data'!A:F,6,0)),0,VLOOKUP(A52+8860000,'Growth Data'!A:F,6,0))","v":0},0,"NO",{"$f":"IF(ISERROR(VLOOKUP(A52+8860000,'Growth Data'!A:C,3,0)),\"NO\",VLOOKUP(A52+8860000,'Growth Data'!A:C,3,0))","v":"NO"},0,0,{"$f":"IF(ISERROR(VLOOKUP(A52+8860000,'Growth Data'!A:G,7,0)),0,VLOOKUP(A52+8860000,'Growth Data'!A:G,7,0))","v":0},0]
[2073,"Langley Park Primary Academy",0,0,0,0,null,0,0,null,0,0,null,0,0,null,0,0,0,0,0,0,0,null,null,0,0,{"$f":"IF(ISERROR(VLOOKUP(A53+8860000,'Growth Data'!A:F,6,0)),0,VLOOKUP(A53+8860000,'Growth Data'!A:F,6,0))","v":0},0,"NO",{"$f":"IF(ISERROR(VLOOKUP(A53+8860000,'Growth Data'!A:C,3,0)),\"NO\",VLOOKUP(A53+8860000,'Growth Data'!A:C,3,0))","v":"YES"},1,0,{"$f":"IF(ISERROR(VLOOKUP(A53+8860000,'Growth Data'!A:G,7,0)),0,VLOOKUP(A53+8860000,'Growth Data'!A:G,7,0))","v":60},1]
[2077,"Westgate Primary School",0,0,0,0,null,0,0,null,0,0,null,0,0,null,0,0,0,0,0,0,0,null,null,0,0,{"$f":"IF(ISERROR(VLOOKUP(A54+8860000,'Growth Data'!A:F,6,0)),0,VLOOKUP(A54+8860000,'Growth Data'!A:F,6,0))","v":0},0,"NO",{"$f":"IF(ISERROR(VLOOKUP(A54+8860000,'Growth Data'!A:C,3,0)),\"NO\",VLOOKUP(A54+8860000,'Growth Data'!A:C,3,0))","v":"NO"},0,0,{"$f":"IF(ISERROR(VLOOKUP(A54+8860000,'Growth Data'!A:G,7,0)),0,VLOOKUP(A54+8860000,'Growth Data'!A:G,7,0))","v":0},0]
[2078,"St Nicholas C of E Primary Academy",0,0,0,0,null,0,0,null,0,0,null,0,0,null,0,0,0,0,0,0,0,null,null,0,0,{"$f":"IF(ISERROR(VLOOKUP(A55+8860000,'Growth Data'!A:F,6,0)),0,VLOOKUP(A55+8860000,'Growth Data'!A:F,6,0))","v":0},0,"NO",{"$f":"IF(ISERROR(VLOOKUP(A55+8860000,'Growth Data'!A:C,3,0)),\"NO\",VLOOKUP(A55+8860000,'Growth Data'!A:C,3,0))","v":"NO"},0,0,{"$f":"IF(ISERROR(VLOOKUP(A55+8860000,'Growth Data'!A:G,7,0)),0,VLOOKUP(A55+8860000,'Growth Data'!A:G,7,0))","v":0},0]
[2080,"Barming Primary School",0,0,0,0,null,0,0,null,0,0,null,0,0,null,0,0,0,0,0,0,0,null,null,0,0,{"$f":"IF(ISERROR(VLOOKUP(A56+8860000,'Growth Data'!A:F,6,0)),0,VLOOKUP(A56+8860000,'Growth Data'!A:F,6,0))","v":0},0,"NO",{"$f":"IF(ISERROR(VLOOKUP(A56+8860000,'Growth Data'!A:C,3,0)),\"NO\",VLOOKUP(A56+8860000,'Growth Data'!A:C,3,0))","v":"NO"},0,0,{"$f":"IF(ISERROR(VLOOKUP(A56+8860000,'Growth Data'!A:G,7,0)),0,VLOOKUP(A56+8860000,'Growth Data'!A:G,7,0))","v":0},0]
[2081,"Brenzett CE Primary School",0,0,0,1534.44,null,1534.44,0,null,0,0,null,0,0,null,0,0,0,0,0,0,0,null,null,0,0,{"$f":"IF(ISERROR(VLOOKUP(A57+8860000,'Growth Data'!A:F,6,0)),0,VLOOKUP(A57+8860000,'Growth Data'!A:F,6,0))","v":0},0,"NO",{"$f":"IF(ISERROR(VLOOKUP(A57+8860000,'Growth Data'!A:C,3,0)),\"NO\",VLOOKUP(A57+8860000,'Growth Data'!A:C,3,0))","v":"NO"},0,0,{"$f":"IF(ISERROR(VLOOKUP(A57+8860000,'Growth Data'!A:G,7,0)),0,VLOOKUP(A57+8860000,'Growth Data'!A:G,7,0))","v":0},0]
[2110,"Culverstone Green Primary School",0,0,0,1492.91,null,1492.91,0,null,0,0,null,0,0,null,0,0,0,0,0,0,0,null,null,0,0,{"$f":"IF(ISERROR(VLOOKUP(A58+8860000,'Growth Data'!A:F,6,0)),0,VLOOKUP(A58+8860000,'Growth Data'!A:F,6,0))","v":0},0,"NO",{"$f":"IF(ISERROR(VLOOKUP(A58+8860000,'Growth Data'!A:C,3,0)),\"NO\",VLOOKUP(A58+8860000,'Growth Data'!A:C,3,0))","v":"NO"},0,0,{"$f":"IF(ISERROR(VLOOKUP(A58+8860000,'Growth Data'!A:G,7,0)),0,VLOOKUP(A58+8860000,'Growth Data'!A:G,7,0))","v":0},0]
[2141,"Amherst School",0,0,0,2312.7199999999998,null,2312.7199999999998,0,null,0,0,null,0,0,null,0,0,0,0,0,0,0,null,null,0,0,{"$f":"IF(ISERROR(VLOOKUP(A59+8860000,'Growth Data'!A:F,6,0)),0,VLOOKUP(A59+8860000,'Growth Data'!A:F,6,0))","v":0},0,"NO",{"$f":"IF(ISERROR(VLOOKUP(A59+8860000,'Growth Data'!A:C,3,0)),\"NO\",VLOOKUP(A59+8860000,'Growth Data'!A:C,3,0))","v":"NO"},0,0,{"$f":"IF(ISERROR(VLOOKUP(A59+8860000,'Growth Data'!A:G,7,0)),0,VLOOKUP(A59+8860000,'Growth Data'!A:G,7,0))","v":0},0]
[2180,"South Borough Primary School",4.83,4.83,0,0,null,0,0,null,0,0,null,0,0,null,0,0,0,0,0,0,0,null,null,0,0,{"$f":"IF(ISERROR(VLOOKUP(A60+8860000,'Growth Data'!A:F,6,0)),0,VLOOKUP(A60+8860000,'Growth Data'!A:F,6,0))","v":31},0,"NO",{"$f":"IF(ISERROR(VLOOKUP(A60+8860000,'Growth Data'!A:C,3,0)),\"NO\",VLOOKUP(A60+8860000,'Growth Data'!A:C,3,0))","v":"YES"},1,0,{"$f":"IF(ISERROR(VLOOKUP(A60+8860000,'Growth Data'!A:G,7,0)),0,VLOOKUP(A60+8860000,'Growth Data'!A:G,7,0))","v":60},1]
[2223,"Bobbing Village School",0,0,0,0,null,0,0,null,0,0,null,0,0,null,0,0,0,0,0,0,0,null,null,0,0,{"$f":"IF(ISERROR(VLOOKUP(A61+8860000,'Growth Data'!A:F,6,0)),0,VLOOKUP(A61+8860000,'Growth Data'!A:F,6,0))","v":0},0,"NO",{"$f":"IF(ISERROR(VLOOKUP(A61+8860000,'Growth Data'!A:C,3,0)),\"NO\",VLOOKUP(A61+8860000,'Growth Data'!A:C,3,0))","v":"NO"},0,0,{"$f":"IF(ISERROR(VLOOKUP(A61+8860000,'Growth Data'!A:G,7,0)),0,VLOOKUP(A61+8860000,'Growth Data'!A:G,7,0))","v":0},0]
[2229,"Graveney Primary School",0,0,0,2033.87,null,2033.87,0,null,0,0,null,0,0,null,0,0,0,0,0,0,0,null,null,0,0,{"$f":"IF(ISERROR(VLOOKUP(A62+8860000,'Growth Data'!A:F,6,0)),0,VLOOKUP(A62+8860000,'Growth Data'!A:F,6,0))","v":0},0,"NO",{"$f":"IF(ISERROR(VLOOKUP(A62+8860000,'Growth Data'!A:C,3,0)),\"NO\",VLOOKUP(A62+8860000,'Growth Data'!A:C,3,0))","v":"NO"},0,0,{"$f":"IF(ISERROR(VLOOKUP(A62+8860000,'Growth Data'!A:G,7,0)),0,VLOOKUP(A62+8860000,'Growth Data'!A:G,7,0))","v":0},0]
[2230,"Iwade School",0,0,0,0,null,0,0,null,0,0,null,0,0,null,0,0,0,0,0,0,0,null,null,0,61,{"$f":"IF(ISERROR(VLOOKUP(A63+8860000,'Growth Data'!A:F,6,0)),0,VLOOKUP(A63+8860000,'Growth Data'!A:F,6,0))","v":63},-2,"YES",{"$f":"IF(ISERROR(VLOOKUP(A63+8860000,'Growth Data'!A:C,3,0)),\"NO\",VLOOKUP(A63+8860000,'Growth Data'!A:C,3,0))","v":"YES"},0,90,{"$f":"IF(ISERROR(VLOOKUP(A63+8860000,'Growth Data'!A:G,7,0)),0,VLOOKUP(A63+8860000,'Growth Data'!A:G,7,0))","v":90},0]
[2232,"Luddenham School",0,0,0,0,null,0,0,null,0,0,null,0,0,null,0,0,0,0,0,0,0,null,null,0,0,{"$f":"IF(ISERROR(VLOOKUP(A64+8860000,'Growth Data'!A:F,6,0)),0,VLOOKUP(A64+8860000,'Growth Data'!A:F,6,0))","v":0},0,"NO",{"$f":"IF(ISERROR(VLOOKUP(A64+8860000,'Growth Data'!A:C,3,0)),\"NO\",VLOOKUP(A64+8860000,'Growth Data'!A:C,3,0))","v":"NO"},0,0,{"$f":"IF(ISERROR(VLOOKUP(A64+8860000,'Growth Data'!A:G,7,0)),0,VLOOKUP(A64+8860000,'Growth Data'!A:G,7,0))","v":0},0]
[2233,"Lynsted and Norton School",0,0,0,1071.3900000000001,null,1071.3900000000001,0,null,0,0,null,0,0,null,0,0,0,0,0,0,0,null,null,0,0,{"$f":"IF(ISERROR(VLOOKUP(A65+8860000,'Growth Data'!A:F,6,0)),0,VLOOKUP(A65+8860000,'Growth Data'!A:F,6,0))","v":0},0,"NO",{"$f":"IF(ISERROR(VLOOKUP(A65+8860000,'Growth Data'!A:C,3,0)),\"NO\",VLOOKUP(A65+8860000,'Growth Data'!A:C,3,0))","v":"NO"},0,0,{"$f":"IF(ISERROR(VLOOKUP(A65+8860000,'Growth Data'!A:G,7,0)),0,VLOOKUP(A65+8860000,'Growth Data'!A:G,7,0))","v":0},0]
[2235,"Minster in Sheppey Primary School",0,0,{"$f":"C66-D66","v":0},0,null,0,0,null,0,0,null,{"$f":"ROUND(L66-M66,2)","v":0},0,null,{"$f":"ROUND(O66-P66,2)","v":0},0,0,{"$f":"ROUND(R66-S66,2)","v":0},0,0,{"$f":"ROUND(U66-V66,2)","v":0},null,null,{"$f":"X66-Y66","v":0},0,{"$f":"IF(ISERROR(VLOOKUP(A66+8860000,'Growth Data'!A:F,6,0)),0,VLOOKUP(A66+8860000,'Growth Data'!A:F,6,0))","v":0},0,"NO",{"$f":"IF(ISERROR(VLOOKUP(A66+8860000,'Growth Data'!A:C,3,0)),\"NO\",VLOOKUP(A66+8860000,'Growth Data'!A:C,3,0))","v":"NO"},{"$f":"IF(AD66=AE66,0,1)","v":0},0,{"$f":"IF(ISERROR(VLOOKUP(A66+8860000,'Growth Data'!A:G,7,0)),0,VLOOKUP(A66+8860000,'Growth Data'!A:G,7,0))","v":0},0]
[2246,"Sheldwich Primary School",0,0,0,1175.47,null,{"$f":"ROUND(F67-G67,2)","v":1175.47},0,null,{"$f":"ROUND(I67-J67,2)","v":0},0,null,0,0,null,0,0,0,0,0,0,0,null,null,0,0,{"$f":"IF(ISERROR(VLOOKUP(A67+8860000,'Growth Data'!A:F,6,0)),0,VLOOKUP(A67+8860000,'Growth Data'!A:F,6,0))","v":0},{"$f":"IF(AD67=\"YES\",AA67-AB67,0)","v":0},"NO",{"$f":"IF(ISERROR(VLOOKUP(A67+8860000,'Growth Data'!A:C,3,0)),\"NO\",VLOOKUP(A67+8860000,'Growth Data'!A:C,3,0))","v":"NO"},0,0,{"$f":"IF(ISERROR(VLOOKUP(A67+8860000,'Growth Data'!A:G,7,0)),0,VLOOKUP(A67+8860000,'Growth Data'!A:G,7,0))","v":0},{"$f":"IF(AG67=AH67,0,1)","v":0}]
[2249,"Regis Manor School",5.08,5.08,0,0,null,0,0,null,0,0,null,0,0,null,0,0,0,0,0,0,0,null,null,0,0,{"$f":"IF(ISERROR(VLOOKUP(A68+8860000,'Growth Data'!A:F,6,0)),0,VLOOKUP(A68+8860000,'Growth Data'!A:F,6,0))","v":0},0,"NO",{"$f":"IF(ISERROR(VLOOKUP(A68+8860000,'Growth Data'!A:C,3,0)),\"NO\",VLOOKUP(A68+8860000,'Growth Data'!A:C,3,0))","v":"NO"},0,0,{"$f":"IF(ISERROR(VLOOKUP(A68+8860000,'Growth Data'!A:G,7,0)),0,VLOOKUP(A68+8860000,'Growth Data'!A:G,7,0))","v":0},0]
[2264,"Hampton Primary School",4.8099999999999996,4.8100000000000005,0,0,null,0,0,null,0,0,null,0,0,null,0,0,0,0,0,0,0,null,null,0,0,{"$f":"IF(ISERROR(VLOOKUP(A69+8860000,'Growth Data'!A:F,6,0)),0,VLOOKUP(A69+8860000,'Growth Data'!A:F,6,0))","v":0},0,"NO",{"$f":"IF(ISERROR(VLOOKUP(A69+8860000,'Growth Data'!A:C,3,0)),\"NO\",VLOOKUP(A69+8860000,'Growth Data'!A:C,3,0))","v":"NO"},0,0,{"$f":"IF(ISERROR(VLOOKUP(A69+8860000,'Growth Data'!A:G,7,0)),0,VLOOKUP(A69+8860000,'Growth Data'!A:G,7,0))","v":0},0]
[2286,"Hamstreet Primary Academy",0,0,0,0,null,0,0,null,0,0,null,0,0,null,0,0,0,0,0,0,0,null,null,0,0,{"$f":"IF(ISERROR(VLOOKUP(A70+8860000,'Growth Data'!A:F,6,0)),0,VLOOKUP(A70+8860000,'Growth Data'!A:F,6,0))","v":0},0,"NO",{"$f":"IF(ISERROR(VLOOKUP(A70+8860000,'Growth Data'!A:C,3,0)),\"NO\",VLOOKUP(A70+8860000,'Growth Data'!A:C,3,0))","v":"NO"},0,0,{"$f":"IF(ISERROR(VLOOKUP(A70+8860000,'Growth Data'!A:G,7,0)),0,VLOOKUP(A70+8860000,'Growth Data'!A:G,7,0))","v":0},0]
[2288,"Smarden Primary School",0,0,0,4018.92,null,4018.92,0,null,0,0,null,0,0,null,0,0,0,0,0,0,0,null,null,0,0,{"$f":"IF(ISERROR(VLOOKUP(A71+8860000,'Growth Data'!A:F,6,0)),0,VLOOKUP(A71+8860000,'Growth Data'!A:F,6,0))","v":0},0,"NO",{"$f":"IF(ISERROR(VLOOKUP(A71+8860000,'Growth Data'!A:C,3,0)),\"NO\",VLOOKUP(A71+8860000,'Growth Data'!A:C,3,0))","v":"NO"},0,0,{"$f":"IF(ISERROR(VLOOKUP(A71+8860000,'Growth Data'!A:G,7,0)),0,VLOOKUP(A71+8860000,'Growth Data'!A:G,7,0))","v":0},0]
[2290,"Tenterden Infant School",0,0,0,2384.7800000000002,null,2384.7800000000002,0,null,0,0,null,0,0,null,0,0,0,0,0,0,0,null,null,0,0,{"$f":"IF(ISERROR(VLOOKUP(A72+8860000,'Growth Data'!A:F,6,0)),0,VLOOKUP(A72+8860000,'Growth Data'!A:F,6,0))","v":0},0,"NO",{"$f":"IF(ISERROR(VLOOKUP(A72+8860000,'Growth Data'!A:C,3,0)),\"NO\",VLOOKUP(A72+8860000,'Growth Data'!A:C,3,0))","v":"NO"},0,0,{"$f":"IF(ISERROR(VLOOKUP(A72+8860000,'Growth Data'!A:G,7,0)),0,VLOOKUP(A72+8860000,'Growth Data'!A:G,7,0))","v":0},0]
[2307,"Warden House Primary School",0,0,0,0,null,0,0,null,0,0,null,0,0,null,0,0,0,0,0,0,0,null,null,0,0,{"$f":"IF(ISERROR(VLOOKUP(A73+8860000,'Growth Data'!A:F,6,0)),0,VLOOKUP(A73+8860000,'Growth Data'!A:F,6,0))","v":0},0,"NO",{"$f":"IF(ISERROR(VLOOKUP(A73+8860000,'Growth Data'!A:C,3,0)),\"NO\",VLOOKUP(A73+8860000,'Growth Data'!A:C,3,0))","v":"NO"},0,0,{"$f":"IF(ISERROR(VLOOKUP(A73+8860000,'Growth Data'!A:G,7,0)),0,VLOOKUP(A73+8860000,'Growth Data'!A:G,7,0))","v":0},0]
[2309,"Priory Fields School",0,0,0,0,null,0,0,null,0,0,null,0,0,null,0,0,0,0,0,0,0,null,null,0,0,{"$f":"IF(ISERROR(VLOOKUP(A74+8860000,'Growth Data'!A:F,6,0)),0,VLOOKUP(A74+8860000,'Growth Data'!A:F,6,0))","v":0},0,"NO",{"$f":"IF(ISERROR(VLOOKUP(A74+8860000,'Growth Data'!A:C,3,0)),\"NO\",VLOOKUP(A74+8860000,'Growth Data'!A:C,3,0))","v":"NO"},0,0,{"$f":"IF(ISERROR(VLOOKUP(A74+8860000,'Growth Data'!A:G,7,0)),0,VLOOKUP(A74+8860000,'Growth Data'!A:G,7,0))","v":0},0]
[2310,"Barton Junior School",0,0,0,0,null,0,0,null,0,0,null,0,0,null,0,0,0,0,0,0,0,null,null,0,0,{"$f":"IF(ISERROR(VLOOKUP(A75+8860000,'Growth Data'!A:F,6,0)),0,VLOOKUP(A75+8860000,'Growth Data'!A:F,6,0))","v":0},0,"NO",{"$f":"IF(ISERROR(VLOOKUP(A75+8860000,'Growth Data'!A:C,3,0)),\"NO\",VLOOKUP(A75+8860000,'Growth Data'!A:C,3,0))","v":"NO"},0,0,{"$f":"IF(ISERROR(VLOOKUP(A75+8860000,'Growth Data'!A:G,7,0)),0,VLOOKUP(A75+8860000,'Growth Data'!A:G,7,0))","v":0},0]
[2313,"St Martin's School",0,0,0,0,null,0,0,null,0,0,null,0,0,null,0,0,0,0,0,0,0,null,null,0,0,{"$f":"IF(ISERROR(VLOOKUP(A76+8860000,'Growth Data'!A:F,6,0)),0,VLOOKUP(A76+8860000,'Growth Data'!A:F,6,0))","v":0},0,"NO",{"$f":"IF(ISERROR(VLOOKUP(A76+8860000,'Growth Data'!A:C,3,0)),\"NO\",VLOOKUP(A76+8860000,'Growth Data'!A:C,3,0))","v":"NO"},0,0,{"$f":"IF(ISERROR(VLOOKUP(A76+8860000,'Growth Data'!A:G,7,0)),0,VLOOKUP(A76+8860000,'Growth Data'!A:G,7,0))","v":0},0]
[2315,"White Cliffs Primary College for the Arts",0,0,0,0,null,0,0,null,0,0,null,0,0,null,0,0,0,0,0,0,0,null,null,0,30,{"$f":"IF(ISERROR(VLOOKUP(A77+8860000,'Growth Data'!A:F,6,0)),0,VLOOKUP(A77+8860000,'Growth Data'!A:F,6,0))","v":30},0,"YES",{"$f":"IF(ISERROR(VLOOKUP(A77+8860000,'Growth Data'!A:C,3,0)),\"NO\",VLOOKUP(A77+8860000,'Growth Data'!A:C,3,0))","v":"YES"},0,60,{"$f":"IF(ISERROR(VLOOKUP(A77+8860000,'Growth Data'!A:G,7,0)),0,VLOOKUP(A77+8860000,'Growth Data'!A:G,7,0))","v":60},0]
[2316,"Shatterlocks Infant School",5.05,5.0500000000000007,0,0,null,0,0,null,0,0,null,0,0,null,0,0,0,0,0,0,0,null,null,0,0,{"$f":"IF(ISERROR(VLOOKUP(A78+8860000,'Growth Data'!A:F,6,0)),0,VLOOKUP(A78+8860000,'Growth Data'!A:F,6,0))","v":0},0,"NO",{"$f":"IF(ISERROR(VLOOKUP(A78+8860000,'Growth Data'!A:C,3,0)),\"NO\",VLOOKUP(A78+8860000,'Growth Data'!A:C,3,0))","v":"NO"},0,0,{"$f":"IF(ISERROR(VLOOKUP(A78+8860000,'Growth Data'!A:G,7,0)),0,VLOOKUP(A78+8860000,'Growth Data'!A:G,7,0))","v":0},0]
[2435,"South Avenue Primary School",0,0,0,0,null,0,0,null,0,0,null,0,0,null,0,0,0,0,0,0,0,null,null,0,0,{"$f":"IF(ISERROR(VLOOKUP(A79+8860000,'Growth Data'!A:F,6,0)),0,VLOOKUP(A79+8860000,'Growth Data'!A:F,6,0))","v":0},0,"NO",{"$f":"IF(ISERROR(VLOOKUP(A79+8860000,'Growth Data'!A:C,3,0)),\"NO\",VLOOKUP(A79+8860000,'Growth Data'!A:C,3,0))","v":"NO"},0,0,{"$f":"IF(ISERROR(VLOOKUP(A79+8860000,'Growth Data'!A:G,7,0)),0,VLOOKUP(A79+8860000,'Growth Data'!A:G,7,0))","v":0},0]
[2438,"Joydens Wood Junior School",0,0,0,24.93,null,24.93,0,null,0,0,null,0,0,null,0,0,0,0,0,0,0,null,null,0,0,{"$f":"IF(ISERROR(VLOOKUP(A80+8860000,'Growth Data'!A:F,6,0)),0,VLOOKUP(A80+8860000,'Growth Data'!A:F,6,0))","v":79},0,"NO",{"$f":"IF(ISERROR(VLOOKUP(A80+8860000,'Growth Data'!A:C,3,0)),\"NO\",VLOOKUP(A80+8860000,'Growth Data'!A:C,3,0))","v":"YES"},1,0,{"$f":"IF(ISERROR(VLOOKUP(A80+8860000,'Growth Data'!A:G,7,0)),0,VLOOKUP(A80+8860000,'Growth Data'!A:G,7,0))","v":90},1]
[2462,"Riverview Infant School",0,0,0,0,null,0,0,null,0,0,null,0,0,null,0,0,0,0,0,0,0,null,null,0,0,{"$f":"IF(ISERROR(VLOOKUP(A81+8860000,'Growth Data'!A:F,6,0)),0,VLOOKUP(A81+8860000,'Growth Data'!A:F,6,0))","v":0},0,"NO",{"$f":"IF(ISERROR(VLOOKUP(A81+8860000,'Growth Data'!A:C,3,0)),\"NO\",VLOOKUP(A81+8860000,'Growth Data'!A:C,3,0))","v":"NO"},0,0,{"$f":"IF(ISERROR(VLOOKUP(A81+8860000,'Growth Data'!A:G,7,0)),0,VLOOKUP(A81+8860000,'Growth Data'!A:G,7,0))","v":0},0]
[2500,"Joydens Wood Infant School",0,0,0,0,null,0,0,null,0,0,null,0,0,null,0,0,0,0,0,0,0,null,null,0,0,{"$f":"IF(ISERROR(VLOOKUP(A82+8860000,'Growth Data'!A:F,6,0)),0,VLOOKUP(A82+8860000,'Growth Data'!A:F,6,0))","v":0},0,"NO",{"$f":"IF(ISERROR(VLOOKUP(A82+8860000,'Growth Data'!A:C,3,0)),\"NO\",VLOOKUP(A82+8860000,'Growth Data'!A:C,3,0))","v":"NO"},0,0,{"$f":"IF(ISERROR(VLOOKUP(A82+8860000,'Growth Data'!A:G,7,0)),0,VLOOKUP(A82+8860000,'Growth Data'!A:G,7,0))","v":0},0]
[2511,"Hartley Primary Academy",0,0,0,0,null,0,0,null,0,0,null,0,0,null,0,0,0,0,0,0,0,null,null,0,0,{"$f":"IF(ISERROR(VLOOKUP(A83+8860000,'Growth Data'!A:F,6,0)),0,VLOOKUP(A83+8860000,'Growth Data'!A:F,6,0))","v":0},0,"NO",{"$f":"IF(ISERROR(VLOOKUP(A83+8860000,'Growth Data'!A:C,3,0)),\"NO\",VLOOKUP(A83+8860000,'Growth Data'!A:C,3,0))","v":"NO"},0,0,{"$f":"IF(ISERROR(VLOOKUP(A83+8860000,'Growth Data'!A:G,7,0)),0,VLOOKUP(A83+8860000,'Growth Data'!A:G,7,0))","v":0},0]
[2523,"Upton Junior School",0,0,0,0,null,0,0,null,0,0,null,0,0,null,0,0,0,0,0,0,0,null,null,0,0,{"$f":"IF(ISERROR(VLOOKUP(A84+8860000,'Growth Data'!A:F,6,0)),0,VLOOKUP(A84+8860000,'Growth Data'!A:F,6,0))","v":0},0,"NO",{"$f":"IF(ISERROR(VLOOKUP(A84+8860000,'Growth Data'!A:C,3,0)),\"NO\",VLOOKUP(A84+8860000,'Growth Data'!A:C,3,0))","v":"NO"},0,0,{"$f":"IF(ISERROR(VLOOKUP(A84+8860000,'Growth Data'!A:G,7,0)),0,VLOOKUP(A84+8860000,'Growth Data'!A:G,7,0))","v":0},0]
[2595,"Grove Park Primary School",0,0,0,0,null,0,0,null,0,0,null,0,0,null,0,0,0,0,0,0,0,null,null,0,0,{"$f":"IF(ISERROR(VLOOKUP(A85+8860000,'Growth Data'!A:F,6,0)),0,VLOOKUP(A85+8860000,'Growth Data'!A:F,6,0))","v":0},0,"NO",{"$f":"IF(ISERROR(VLOOKUP(A85+8860000,'Growth Data'!A:C,3,0)),\"NO\",VLOOKUP(A85+8860000,'Growth Data'!A:C,3,0))","v":"NO"},0,0,{"$f":"IF(ISERROR(VLOOKUP(A85+8860000,'Growth Data'!A:G,7,0)),0,VLOOKUP(A85+8860000,'Growth Data'!A:G,7,0))","v":0},0]
[2596,"Chilton Academy Primary School",0,0,0,0,null,0,0,null,0,0,null,0,0,null,0,0,0,0,0,0,0,null,null,0,0,{"$f":"IF(ISERROR(VLOOKUP(A86+8860000,'Growth Data'!A:F,6,0)),0,VLOOKUP(A86+8860000,'Growth Data'!A:F,6,0))","v":0},0,"NO",{"$f":"IF(ISERROR(VLOOKUP(A86+8860000,'Growth Data'!A:C,3,0)),\"NO\",VLOOKUP(A86+8860000,'Growth Data'!A:C,3,0))","v":"NO"},0,0,{"$f":"IF(ISERROR(VLOOKUP(A86+8860000,'Growth Data'!A:G,7,0)),0,VLOOKUP(A86+8860000,'Growth Data'!A:G,7,0))","v":0},0]
[2608,"St Stephen's Junior School",0,0,0,0,null,0,0,null,0,0,null,0,0,null,0,0,0,0,0,0,0,null,null,0,0,{"$f":"IF(ISERROR(VLOOKUP(A87+8860000,'Growth Data'!A:F,6,0)),0,VLOOKUP(A87+8860000,'Growth Data'!A:F,6,0))","v":0},0,"NO",{"$f":"IF(ISERROR(VLOOKUP(A87+8860000,'Growth Data'!A:C,3,0)),\"NO\",VLOOKUP(A87+8860000,'Growth Data'!A:C,3,0))","v":"NO"},0,0,{"$f":"IF(ISERROR(VLOOKUP(A87+8860000,'Growth Data'!A:G,7,0)),0,VLOOKUP(A87+8860000,'Growth Data'!A:G,7,0))","v":0},0]
[2625,"Godinton Primary Academy",0,0,0,0,null,0,0,null,0,0,null,0,0,null,0,0,0,0,0,0,0,null,null,0,0,{"$f":"IF(ISERROR(VLOOKUP(A88+8860000,'Growth Data'!A:F,6,0)),0,VLOOKUP(A88+8860000,'Growth Data'!A:F,6,0))","v":0},0,"NO",{"$f":"IF(ISERROR(VLOOKUP(A88+8860000,'Growth Data'!A:C,3,0)),\"NO\",VLOOKUP(A88+8860000,'Growth Data'!A:C,3,0))","v":"NO"},0,0,{"$f":"IF(ISERROR(VLOOKUP(A88+8860000,'Growth Data'!A:G,7,0)),0,VLOOKUP(A88+8860000,'Growth Data'!A:G,7,0))","v":0},0]
[2650,"Dymchurch Primary School",0,0,0,0,null,0,0,null,0,0,null,0,0,null,0,0,0,0,0,0,0,null,null,0,0,{"$f":"IF(ISERROR(VLOOKUP(A89+8860000,'Growth Data'!A:F,6,0)),0,VLOOKUP(A89+8860000,'Growth Data'!A:F,6,0))","v":0},0,"NO",{"$f":"IF(ISERROR(VLOOKUP(A89+8860000,'Growth Data'!A:C,3,0)),\"NO\",VLOOKUP(A89+8860000,'Growth Data'!A:C,3,0))","v":"NO"},0,0,{"$f":"IF(ISERROR(VLOOKUP(A89+8860000,'Growth Data'!A:G,7,0)),0,VLOOKUP(A89+8860000,'Growth Data'!A:G,7,0))","v":0},0]
[2654,"Canterbury Primary School, The",0,0,0,0,null,0,0,null,0,0,null,0,0,null,0,0,0,0,0,0,0,null,null,0,0,{"$f":"IF(ISERROR(VLOOKUP(A90+8860000,'Growth Data'!A:F,6,0)),0,VLOOKUP(A90+8860000,'Growth Data'!A:F,6,0))","v":40},0,"NO",{"$f":"IF(ISERROR(VLOOKUP(A90+8860000,'Growth Data'!A:C,3,0)),\"NO\",VLOOKUP(A90+8860000,'Growth Data'!A:C,3,0))","v":"YES"},1,0,{"$f":"IF(ISERROR(VLOOKUP(A90+8860000,'Growth Data'!A:G,7,0)),0,VLOOKUP(A90+8860000,'Growth Data'!A:G,7,0))","v":60},1]
[2656,"Meopham Community Academy",0,0,0,0,null,0,0,null,0,0,null,0,0,null,0,0,0,0,0,0,0,null,null,0,0,{"$f":"IF(ISERROR(VLOOKUP(A91+8860000,'Growth Data'!A:F,6,0)),0,VLOOKUP(A91+8860000,'Growth Data'!A:F,6,0))","v":0},0,"NO",{"$f":"IF(ISERROR(VLOOKUP(A91+8860000,'Growth Data'!A:C,3,0)),\"NO\",VLOOKUP(A91+8860000,'Growth Data'!A:C,3,0))","v":"NO"},0,0,{"$f":"IF(ISERROR(VLOOKUP(A91+8860000,'Growth Data'!A:G,7,0)),0,VLOOKUP(A91+8860000,'Growth Data'!A:G,7,0))","v":0},0]
[2657,"Temple Hill Primary Academy",5.03,5.03,0,0,null,0,0,null,0,0,null,0,0,null,0,0,0,0,0,0,0,null,null,0,0,{"$f":"IF(ISERROR(VLOOKUP(A92+8860000,'Growth Data'!A:F,6,0)),0,VLOOKUP(A92+8860000,'Growth Data'!A:F,6,0))","v":90},0,"NO",{"$f":"IF(ISERROR(VLOOKUP(A92+8860000,'Growth Data'!A:C,3,0)),\"NO\",VLOOKUP(A92+8860000,'Growth Data'!A:C,3,0))","v":"YES"},1,0,{"$f":"IF(ISERROR(VLOOKUP(A92+8860000,'Growth Data'!A:G,7,0)),0,VLOOKUP(A92+8860000,'Growth Data'!A:G,7,0))","v":120},1]
[2658,"Westcourt School",5.0599999999999996,5.0600000000000005,0,0,null,0,0,null,0,0,null,0,0,null,0,0,904.18911113936667,-904.19,0,834.46555102667071,-834.47,null,null,0,0,{"$f":"IF(ISERROR(VLOOKUP(A93+8860000,'Growth Data'!A:F,6,0)),0,VLOOKUP(A93+8860000,'Growth Data'!A:F,6,0))","v":30},0,"NO",{"$f":"IF(ISERROR(VLOOKUP(A93+8860000,'Growth Data'!A:C,3,0)),\"NO\",VLOOKUP(A93+8860000,'Growth Data'!A:C,3,0))","v":"YES"},1,0,{"$f":"IF(ISERROR(VLOOKUP(A93+8860000,'Growth Data'!A:G,7,0)),0,VLOOKUP(A93+8860000,'Growth Data'!A:G,7,0))","v":60},1]
[2679,"Brent Primary School, The",0,0,0,0,null,0,0,null,0,0,null,0,0,null,0,0,0,0,0,0,0,null,null,0,0,{"$f":"IF(ISERROR(VLOOKUP(A94+8860000,'Growth Data'!A:F,6,0)),0,VLOOKUP(A94+8860000,'Growth Data'!A:F,6,0))","v":62},0,"NO",{"$f":"IF(ISERROR(VLOOKUP(A94+8860000,'Growth Data'!A:C,3,0)),\"NO\",VLOOKUP(A94+8860000,'Growth Data'!A:C,3,0))","v":"YES"},1,0,{"$f":"IF(ISERROR(VLOOKUP(A94+8860000,'Growth Data'!A:G,7,0)),0,VLOOKUP(A94+8860000,'Growth Data'!A:G,7,0))","v":90},1]
[2684,"Wentworth Primary School",0,0,0,0,null,0,0,null,0,0,null,0,0,null,0,0,0,0,0,0,0,null,null,0,0,{"$f":"IF(ISERROR(VLOOKUP(A95+8860000,'Growth Data'!A:F,6,0)),0,VLOOKUP(A95+8860000,'Growth Data'!A:F,6,0))","v":73},0,"NO",{"$f":"IF(ISERROR(VLOOKUP(A95+8860000,'Growth Data'!A:C,3,0)),\"NO\",VLOOKUP(A95+8860000,'Growth Data'!A:C,3,0))","v":"YES"},1,0,{"$f":"IF(ISERROR(VLOOKUP(A95+8860000,'Growth Data'!A:G,7,0)),0,VLOOKUP(A95+8860000,'Growth Data'!A:G,7,0))","v":90},1]
[2685,"Gateway Primary Academy, The",0,0,0,0,null,0,0,null,0,0,null,0,0,null,0,0,0,0,0,0,0,null,null,0,0,{"$f":"IF(ISERROR(VLOOKUP(A96+8860000,'Growth Data'!A:F,6,0)),0,VLOOKUP(A96+8860000,'Growth Data'!A:F,6,0))","v":0},0,"NO",{"$f":"IF(ISERROR(VLOOKUP(A96+8860000,'Growth Data'!A:C,3,0)),\"NO\",VLOOKUP(A96+8860000,'Growth Data'!A:C,3,0))","v":"NO"},0,0,{"$f":"IF(ISERROR(VLOOKUP(A96+8860000,'Growth Data'!A:G,7,0)),0,VLOOKUP(A96+8860000,'Growth Data'!A:G,7,0))","v":0},0]
[2686,"Furley Park Primary Academy",0,0,0,0,null,0,0,null,0,0,null,0,0,null,0,0,0,0,0,0,0,null,null,0,62,{"$f":"IF(ISERROR(VLOOKUP(A97+8860000,'Growth Data'!A:F,6,0)),0,VLOOKUP(A97+8860000,'Growth Data'!A:F,6,0))","v":0},62,"YES",{"$f":"IF(ISERROR(VLOOKUP(A97+8860000,'Growth Data'!A:C,3,0)),\"NO\",VLOOKUP(A97+8860000,'Growth Data'!A:C,3,0))","v":"NO"},1,90,{"$f":"IF(ISERROR(VLOOKUP(A97+8860000,'Growth Data'!A:G,7,0)),0,VLOOKUP(A97+8860000,'Growth Data'!A:G,7,0))","v":0},1]
[3019,"Shorne Church of England (V.C) Primary School",0,0,{"$f":"C98-D98","v":0},0,null,0,0,null,0,0,null,{"$f":"ROUND(L98-M98,2)","v":0},0,null,{"$f":"ROUND(O98-P98,2)","v":0},0,0,{"$f":"ROUND(R98-S98,2)","v":0},0,0,{"$f":"ROUND(U98-V98,2)","v":0},null,null,{"$f":"X98-Y98","v":0},0,{"$f":"IF(ISERROR(VLOOKUP(A98+8860000,'Growth Data'!A:F,6,0)),0,VLOOKUP(A98+8860000,'Growth Data'!A:F,6,0))","v":0},0,"NO",{"$f":"IF(ISERROR(VLOOKUP(A98+8860000,'Growth Data'!A:C,3,0)),\"NO\",VLOOKUP(A98+8860000,'Growth Data'!A:C,3,0))","v":"NO"},{"$f":"IF(AD98=AE98,0,1)","v":0},0,{"$f":"IF(ISERROR(VLOOKUP(A98+8860000,'Growth Data'!A:G,7,0)),0,VLOOKUP(A98+8860000,'Growth Data'!A:G,7,0))","v":0},0]
[3025,"Chiddingstone CEP School",0,0,0,4278.45,null,4278.45,0,null,0,0,null,0,0,null,0,0,0,0,0,0,0,null,null,0,0,{"$f":"IF(ISERROR(VLOOKUP(A99+8860000,'Growth Data'!A:F,6,0)),0,VLOOKUP(A99+8860000,'Growth Data'!A:F,6,0))","v":0},0,"NO",{"$f":"IF(ISERROR(VLOOKUP(A99+8860000,'Growth Data'!A:C,3,0)),\"NO\",VLOOKUP(A99+8860000,'Growth Data'!A:C,3,0))","v":"NO"},0,0,{"$f":"IF(ISERROR(VLOOKUP(A99+8860000,'Growth Data'!A:G,7,0)),0,VLOOKUP(A99+8860000,'Growth Data'!A:G,7,0))","v":0},0]
[3086,"West Malling CEP School",0,0,0,0,null,0,0,null,0,0,null,0,0,null,0,0,0,0,0,0,0,null,null,0,0,{"$f":"IF(ISERROR(VLOOKUP(A100+8860000,'Growth Data'!A:F,6,0)),0,VLOOKUP(A100+8860000,'Growth Data'!A:F,6,0))","v":0},0,"NO",{"$f":"IF(ISERROR(VLOOKUP(A100+8860000,'Growth Data'!A:C,3,0)),\"NO\",VLOOKUP(A100+8860000,'Growth Data'!A:C,3,0))","v":"NO"},0,0,{"$f":"IF(ISERROR(VLOOKUP(A100+8860000,'Growth Data'!A:G,7,0)),0,VLOOKUP(A100+8860000,'Growth Data'!A:G,7,0))","v":0},0]
[3110,"Milstead and Frinsted CEP School",0,0,0,2232.02,null,2232.02,0,null,0,0,null,0,0,null,0,0,0,0,0,0,0,null,null,0,0,{"$f":"IF(ISERROR(VLOOKUP(A101+8860000,'Growth Data'!A:F,6,0)),0,VLOOKUP(A101+8860000,'Growth Data'!A:F,6,0))","v":0},0,"NO",{"$f":"IF(ISERROR(VLOOKUP(A101+8860000,'Growth Data'!A:C,3,0)),\"NO\",VLOOKUP(A101+8860000,'Growth Data'!A:C,3,0))","v":"NO"},0,0,{"$f":"IF(ISERROR(VLOOKUP(A101+8860000,'Growth Data'!A:G,7,0)),0,VLOOKUP(A101+8860000,'Growth Data'!A:G,7,0))","v":0},0]
[3112,"Selling CEP School",0,0,0,1656.13,null,1656.13,0,null,0,0,null,0,0,null,0,0,0,0,0,0,0,null,null,0,0,{"$f":"IF(ISERROR(VLOOKUP(A102+8860000,'Growth Data'!A:F,6,0)),0,VLOOKUP(A102+8860000,'Growth Data'!A:F,6,0))","v":0},0,"NO",{"$f":"IF(ISERROR(VLOOKUP(A102+8860000,'Growth Data'!A:C,3,0)),\"NO\",VLOOKUP(A102+8860000,'Growth Data'!A:C,3,0))","v":"NO"},0,0,{"$f":"IF(ISERROR(VLOOKUP(A102+8860000,'Growth Data'!A:G,7,0)),0,VLOOKUP(A102+8860000,'Growth Data'!A:G,7,0))","v":0},0]
[3119,"Adisham CEP School",0,0,0,2608.59,null,2608.59,0,null,0,0,null,0,0,null,0,0,0,0,0,0,0,null,null,0,0,{"$f":"IF(ISERROR(VLOOKUP(A103+8860000,'Growth Data'!A:F,6,0)),0,VLOOKUP(A103+8860000,'Growth Data'!A:F,6,0))","v":0},0,"NO",{"$f":"IF(ISERROR(VLOOKUP(A103+8860000,'Growth Data'!A:C,3,0)),\"NO\",VLOOKUP(A103+8860000,'Growth Data'!A:C,3,0))","v":"NO"},0,0,{"$f":"IF(ISERROR(VLOOKUP(A103+8860000,'Growth Data'!A:G,7,0)),0,VLOOKUP(A103+8860000,'Growth Data'!A:G,7,0))","v":0},0]
[3128,"Sturry CEP School",0,0,0,0,null,0,0,null,0,0,null,0,0,null,0,0,0,0,0,0,0,null,null,0,0,{"$f":"IF(ISERROR(VLOOKUP(A104+8860000,'Growth Data'!A:F,6,0)),0,VLOOKUP(A104+8860000,'Growth Data'!A:F,6,0))","v":0},0,"NO",{"$f":"IF(ISERROR(VLOOKUP(A104+8860000,'Growth Data'!A:C,3,0)),\"NO\",VLOOKUP(A104+8860000,'Growth Data'!A:C,3,0))","v":"NO"},0,0,{"$f":"IF(ISERROR(VLOOKUP(A104+8860000,'Growth Data'!A:G,7,0)),0,VLOOKUP(A104+8860000,'Growth Data'!A:G,7,0))","v":0},0]
[3140,"Kingsnorth CEP School",0,0,0,0,null,0,0,null,0,0,null,0,0,null,0,0,0,0,0,0,0,null,null,0,0,{"$f":"IF(ISERROR(VLOOKUP(A105+8860000,'Growth Data'!A:F,6,0)),0,VLOOKUP(A105+8860000,'Growth Data'!A:F,6,0))","v":0},0,"NO",{"$f":"IF(ISERROR(VLOOKUP(A105+8860000,'Growth Data'!A:C,3,0)),\"NO\",VLOOKUP(A105+8860000,'Growth Data'!A:C,3,0))","v":"NO"},0,0,{"$f":"IF(ISERROR(VLOOKUP(A105+8860000,'Growth Data'!A:G,7,0)),0,VLOOKUP(A105+8860000,'Growth Data'!A:G,7,0))","v":0},0]
[3142,"Pluckley CEP School",0,0,0,3392.91,null,3392.91,0,null,0,0,null,0,0,null,0,0,0,0,0,0,0,null,null,0,0,{"$f":"IF(ISERROR(VLOOKUP(A106+8860000,'Growth Data'!A:F,6,0)),0,VLOOKUP(A106+8860000,'Growth Data'!A:F,6,0))","v":0},0,"NO",{"$f":"IF(ISERROR(VLOOKUP(A106+8860000,'Growth Data'!A:C,3,0)),\"NO\",VLOOKUP(A106+8860000,'Growth Data'!A:C,3,0))","v":"NO"},0,0,{"$f":"IF(ISERROR(VLOOKUP(A106+8860000,'Growth Data'!A:G,7,0)),0,VLOOKUP(A106+8860000,'Growth Data'!A:G,7,0))","v":0},0]
[3143,"St Michael's CEP School",0,0,0,1618.35,null,1618.35,0,null,0,0,null,0,0,null,0,0,0,0,0,0,0,null,null,0,0,{"$f":"IF(ISERROR(VLOOKUP(A107+8860000,'Growth Data'!A:F,6,0)),0,VLOOKUP(A107+8860000,'Growth Data'!A:F,6,0))","v":0},0,"NO",{"$f":"IF(ISERROR(VLOOKUP(A107+8860000,'Growth Data'!A:C,3,0)),\"NO\",VLOOKUP(A107+8860000,'Growth Data'!A:C,3,0))","v":"NO"},0,0,{"$f":"IF(ISERROR(VLOOKUP(A107+8860000,'Growth Data'!A:G,7,0)),0,VLOOKUP(A107+8860000,'Growth Data'!A:G,7,0))","v":0},0]
[3144,"Tenterden CEJ School",0,0,0,1980.78,null,1980.78,0,null,0,0,null,0,0,null,0,0,0,0,0,0,0,null,null,0,0,{"$f":"IF(ISERROR(VLOOKUP(A108+8860000,'Growth Data'!A:F,6,0)),0,VLOOKUP(A108+8860000,'Growth Data'!A:F,6,0))","v":0},0,"NO",{"$f":"IF(ISERROR(VLOOKUP(A108+8860000,'Growth Data'!A:C,3,0)),\"NO\",VLOOKUP(A108+8860000,'Growth Data'!A:C,3,0))","v":"NO"},0,0,{"$f":"IF(ISERROR(VLOOKUP(A108+8860000,'Growth Data'!A:G,7,0)),0,VLOOKUP(A108+8860000,'Growth Data'!A:G,7,0))","v":0},0]
[3148,"Christ Church CEP Academy, Folkestone",0,0,0,0,null,0,0,null,0,0,null,0,0,null,0,0,0,0,0,0,0,null,null,0,0,{"$f":"IF(ISERROR(VLOOKUP(A109+8860000,'Growth Data'!A:F,6,0)),0,VLOOKUP(A109+8860000,'Growth Data'!A:F,6,0))","v":0},0,"NO",{"$f":"IF(ISERROR(VLOOKUP(A109+8860000,'Growth Data'!A:C,3,0)),\"NO\",VLOOKUP(A109+8860000,'Growth Data'!A:C,3,0))","v":"NO"},0,0,{"$f":"IF(ISERROR(VLOOKUP(A109+8860000,'Growth Data'!A:G,7,0)),0,VLOOKUP(A109+8860000,'Growth Data'!A:G,7,0))","v":0},0]
[3306,"Brenchley & Matfield CEP School",0,0,0,3152.63,null,3152.63,0,null,0,0,null,0,0,null,0,0,0,0,0,0,0,null,null,0,0,{"$f":"IF(ISERROR(VLOOKUP(A110+8860000,'Growth Data'!A:F,6,0)),0,VLOOKUP(A110+8860000,'Growth Data'!A:F,6,0))","v":0},0,"NO",{"$f":"IF(ISERROR(VLOOKUP(A110+8860000,'Growth Data'!A:C,3,0)),\"NO\",VLOOKUP(A110+8860000,'Growth Data'!A:C,3,0))","v":"NO"},0,0,{"$f":"IF(ISERROR(VLOOKUP(A110+8860000,'Growth Data'!A:G,7,0)),0,VLOOKUP(A110+8860000,'Growth Data'!A:G,7,0))","v":0},0]
[3348,"St Eanswythe's CEP School",0,0,0,0,null,0,0,null,0,0,null,0,0,null,0,0,0,0,0,0,0,null,null,0,0,{"$f":"IF(ISERROR(VLOOKUP(A111+8860000,'Growth Data'!A:F,6,0)),0,VLOOKUP(A111+8860000,'Growth Data'!A:F,6,0))","v":0},0,"NO",{"$f":"IF(ISERROR(VLOOKUP(A111+8860000,'Growth Data'!A:C,3,0)),\"NO\",VLOOKUP(A111+8860000,'Growth Data'!A:C,3,0))","v":"NO"},0,0,{"$f":"IF(ISERROR(VLOOKUP(A111+8860000,'Growth Data'!A:G,7,0)),0,VLOOKUP(A111+8860000,'Growth Data'!A:G,7,0))","v":0},0]
[3349,"Folkestone St Mary's CEP Academy",5.1100000000000003,5.1100000000000003,0,0,null,0,0,null,0,0,null,0,0,null,0,0,0,0,0,0,0,null,null,0,0,{"$f":"IF(ISERROR(VLOOKUP(A112+8860000,'Growth Data'!A:F,6,0)),0,VLOOKUP(A112+8860000,'Growth Data'!A:F,6,0))","v":0},0,"NO",{"$f":"IF(ISERROR(VLOOKUP(A112+8860000,'Growth Data'!A:C,3,0)),\"NO\",VLOOKUP(A112+8860000,'Growth Data'!A:C,3,0))","v":"NO"},0,0,{"$f":"IF(ISERROR(VLOOKUP(A112+8860000,'Growth Data'!A:G,7,0)),0,VLOOKUP(A112+8860000,'Growth Data'!A:G,7,0))","v":0},0]
[3372,"St John's CEP School, Maidstone",0,0,0,0,null,0,0,null,0,0,null,0,0,null,0,0,0,0,0,0,0,null,null,0,30,{"$f":"IF(ISERROR(VLOOKUP(A113+8860000,'Growth Data'!A:F,6,0)),0,VLOOKUP(A113+8860000,'Growth Data'!A:F,6,0))","v":0},30,"YES",{"$f":"IF(ISERROR(VLOOKUP(A113+8860000,'Growth Data'!A:C,3,0)),\"NO\",VLOOKUP(A113+8860000,'Growth Data'!A:C,3,0))","v":"NO"},1,60,{"$f":"IF(ISERROR(VLOOKUP(A113+8860000,'Growth Data'!A:G,7,0)),0,VLOOKUP(A113+8860000,'Growth Data'!A:G,7,0))","v":0},1]
[3708,"St John's Catholic Primary School, Gravesend",4.84,4.8400000000000007,0,0,null,0,0,null,0,0,null,0,0,null,0,0,0,0,0,0,0,null,null,0,0,{"$f":"IF(ISERROR(VLOOKUP(A114+8860000,'Growth Data'!A:F,6,0)),0,VLOOKUP(A114+8860000,'Growth Data'!A:F,6,0))","v":90},0,"NO",{"$f":"IF(ISERROR(VLOOKUP(A114+8860000,'Growth Data'!A:C,3,0)),\"NO\",VLOOKUP(A114+8860000,'Growth Data'!A:C,3,0))","v":"YES"},1,0,{"$f":"IF(ISERROR(VLOOKUP(A114+8860000,'Growth Data'!A:G,7,0)),0,VLOOKUP(A114+8860000,'Growth Data'!A:G,7,0))","v":120},1]
[3714,"St Peter's Catholic Primary School, Sittingbourne",0,0,0,0,null,0,0,null,0,0,null,0,0,null,0,0,0,0,0,0,0,null,null,0,0,{"$f":"IF(ISERROR(VLOOKUP(A115+8860000,'Growth Data'!A:F,6,0)),0,VLOOKUP(A115+8860000,'Growth Data'!A:F,6,0))","v":0},0,"NO",{"$f":"IF(ISERROR(VLOOKUP(A115+8860000,'Growth Data'!A:C,3,0)),\"NO\",VLOOKUP(A115+8860000,'Growth Data'!A:C,3,0))","v":"NO"},0,0,{"$f":"IF(ISERROR(VLOOKUP(A115+8860000,'Growth Data'!A:G,7,0)),0,VLOOKUP(A115+8860000,'Growth Data'!A:G,7,0))","v":0},0]
[3715,"St Mary's Catholic Primary School, Whitstable",0,0,0,0,null,0,0,null,0,0,null,0,0,null,0,0,0,0,0,0,0,null,null,0,0,{"$f":"IF(ISERROR(VLOOKUP(A116+8860000,'Growth Data'!A:F,6,0)),0,VLOOKUP(A116+8860000,'Growth Data'!A:F,6,0))","v":0},0,"NO",{"$f":"IF(ISERROR(VLOOKUP(A116+8860000,'Growth Data'!A:C,3,0)),\"NO\",VLOOKUP(A116+8860000,'Growth Data'!A:C,3,0))","v":"NO"},0,0,{"$f":"IF(ISERROR(VLOOKUP(A116+8860000,'Growth Data'!A:G,7,0)),0,VLOOKUP(A116+8860000,'Growth Data'!A:G,7,0))","v":0},0]
[3719,"St Joseph's Catholic Primary School, Aylesham",0,0,0,536.11,null,536.11,0,null,0,0,null,0,0,null,0,0,0,0,0,0,0,null,null,0,0,{"$f":"IF(ISERROR(VLOOKUP(A117+8860000,'Growth Data'!A:F,6,0)),0,VLOOKUP(A117+8860000,'Growth Data'!A:F,6,0))","v":0},0,"NO",{"$f":"IF(ISERROR(VLOOKUP(A117+8860000,'Growth Data'!A:C,3,0)),\"NO\",VLOOKUP(A117+8860000,'Growth Data'!A:C,3,0))","v":"NO"},0,0,{"$f":"IF(ISERROR(VLOOKUP(A117+8860000,'Growth Data'!A:G,7,0)),0,VLOOKUP(A117+8860000,'Growth Data'!A:G,7,0))","v":0},0]
[3720,"St Mary's Catholic School, Deal",0,0,0,0,null,0,0,null,0,0,null,0,0,null,0,0,0,0,0,0,0,null,null,0,0,{"$f":"IF(ISERROR(VLOOKUP(A118+8860000,'Growth Data'!A:F,6,0)),0,VLOOKUP(A118+8860000,'Growth Data'!A:F,6,0))","v":0},0,"NO",{"$f":"IF(ISERROR(VLOOKUP(A118+8860000,'Growth Data'!A:C,3,0)),\"NO\",VLOOKUP(A118+8860000,'Growth Data'!A:C,3,0))","v":"NO"},0,0,{"$f":"IF(ISERROR(VLOOKUP(A118+8860000,'Growth Data'!A:G,7,0)),0,VLOOKUP(A118+8860000,'Growth Data'!A:G,7,0))","v":0},0]
[3740,"St Richard's Catholic Primary School, Dover",0,0,0,0,null,0,0,null,0,0,null,0,0,null,0,0,0,0,0,0,0,null,null,0,0,{"$f":"IF(ISERROR(VLOOKUP(A119+8860000,'Growth Data'!A:F,6,0)),0,VLOOKUP(A119+8860000,'Growth Data'!A:F,6,0))","v":0},0,"NO",{"$f":"IF(ISERROR(VLOOKUP(A119+8860000,'Growth Data'!A:C,3,0)),\"NO\",VLOOKUP(A119+8860000,'Growth Data'!A:C,3,0))","v":"NO"},0,0,{"$f":"IF(ISERROR(VLOOKUP(A119+8860000,'Growth Data'!A:G,7,0)),0,VLOOKUP(A119+8860000,'Growth Data'!A:G,7,0))","v":0},0]
[3743,"St Simon of England RCP School, Ashford",0,0,0,0,null,0,0,null,0,0,null,0,0,null,0,0,0,0,0,0,0,null,null,0,0,{"$f":"IF(ISERROR(VLOOKUP(A120+8860000,'Growth Data'!A:F,6,0)),0,VLOOKUP(A120+8860000,'Growth Data'!A:F,6,0))","v":0},0,"NO",{"$f":"IF(ISERROR(VLOOKUP(A120+8860000,'Growth Data'!A:C,3,0)),\"NO\",VLOOKUP(A120+8860000,'Growth Data'!A:C,3,0))","v":"NO"},0,0,{"$f":"IF(ISERROR(VLOOKUP(A120+8860000,'Growth Data'!A:G,7,0)),0,VLOOKUP(A120+8860000,'Growth Data'!A:G,7,0))","v":0},0]
[3744,"St Margaret Clitherow Catholic Primary School",0,0,0,0,null,0,0,null,0,0,null,0,0,null,0,0,0,0,0,0,0,null,null,0,0,{"$f":"IF(ISERROR(VLOOKUP(A121+8860000,'Growth Data'!A:F,6,0)),0,VLOOKUP(A121+8860000,'Growth Data'!A:F,6,0))","v":0},0,"NO",{"$f":"IF(ISERROR(VLOOKUP(A121+8860000,'Growth Data'!A:C,3,0)),\"NO\",VLOOKUP(A121+8860000,'Growth Data'!A:C,3,0))","v":"NO"},0,0,{"$f":"IF(ISERROR(VLOOKUP(A121+8860000,'Growth Data'!A:G,7,0)),0,VLOOKUP(A121+8860000,'Growth Data'!A:G,7,0))","v":0},0]
[3745,"More Park RCP School",0,0,0,0,null,0,0,null,0,0,null,0,0,null,0,0,0,0,0,0,0,null,null,0,0,{"$f":"IF(ISERROR(VLOOKUP(A122+8860000,'Growth Data'!A:F,6,0)),0,VLOOKUP(A122+8860000,'Growth Data'!A:F,6,0))","v":0},0,"NO",{"$f":"IF(ISERROR(VLOOKUP(A122+8860000,'Growth Data'!A:C,3,0)),\"NO\",VLOOKUP(A122+8860000,'Growth Data'!A:C,3,0))","v":"NO"},0,0,{"$f":"IF(ISERROR(VLOOKUP(A122+8860000,'Growth Data'!A:G,7,0)),0,VLOOKUP(A122+8860000,'Growth Data'!A:G,7,0))","v":0},0]
[3751,"St Thomas' Catholic Primary School, Sevenoaks",0,0,0,1283.73,null,1283.73,0,null,0,0,null,0,0,null,0,0,0,0,0,0,0,null,null,0,0,{"$f":"IF(ISERROR(VLOOKUP(A123+8860000,'Growth Data'!A:F,6,0)),0,VLOOKUP(A123+8860000,'Growth Data'!A:F,6,0))","v":0},0,"NO",{"$f":"IF(ISERROR(VLOOKUP(A123+8860000,'Growth Data'!A:C,3,0)),\"NO\",VLOOKUP(A123+8860000,'Growth Data'!A:C,3,0))","v":"NO"},0,0,{"$f":"IF(ISERROR(VLOOKUP(A123+8860000,'Growth Data'!A:G,7,0)),0,VLOOKUP(A123+8860000,'Growth Data'!A:G,7,0))","v":0},0]
[3889,"St Gregory's Catholic Primary School, Margate",4.84,4.8400000000000007,0,0,null,0,0,null,0,0,null,0,0,null,0,0,0,0,0,0,0,null,null,0,0,{"$f":"IF(ISERROR(VLOOKUP(A124+8860000,'Growth Data'!A:F,6,0)),0,VLOOKUP(A124+8860000,'Growth Data'!A:F,6,0))","v":0},0,"NO",{"$f":"IF(ISERROR(VLOOKUP(A124+8860000,'Growth Data'!A:C,3,0)),\"NO\",VLOOKUP(A124+8860000,'Growth Data'!A:C,3,0))","v":"NO"},0,0,{"$f":"IF(ISERROR(VLOOKUP(A124+8860000,'Growth Data'!A:G,7,0)),0,VLOOKUP(A124+8860000,'Growth Data'!A:G,7,0))","v":0},0]
[3890,"St Joseph's Catholic Primary School, Broadstairs",0,0,0,0,null,0,0,null,0,0,null,0,0,null,0,0,0,0,0,0,0,null,null,0,0,{"$f":"IF(ISERROR(VLOOKUP(A125+8860000,'Growth Data'!A:F,6,0)),0,VLOOKUP(A125+8860000,'Growth Data'!A:F,6,0))","v":0},0,"NO",{"$f":"IF(ISERROR(VLOOKUP(A125+8860000,'Growth Data'!A:C,3,0)),\"NO\",VLOOKUP(A125+8860000,'Growth Data'!A:C,3,0))","v":"NO"},0,0,{"$f":"IF(ISERROR(VLOOKUP(A125+8860000,'Growth Data'!A:G,7,0)),0,VLOOKUP(A125+8860000,'Growth Data'!A:G,7,0))","v":0},0]
[3900,"Whitehill Primary School",5.1100000000000003,5.1100000000000003,0,0,null,0,0,null,0,0,null,0,0,null,0,0,0,0,0,0,0,null,null,0,0,{"$f":"IF(ISERROR(VLOOKUP(A126+8860000,'Growth Data'!A:F,6,0)),0,VLOOKUP(A126+8860000,'Growth Data'!A:F,6,0))","v":0},0,"NO",{"$f":"IF(ISERROR(VLOOKUP(A126+8860000,'Growth Data'!A:C,3,0)),\"NO\",VLOOKUP(A126+8860000,'Growth Data'!A:C,3,0))","v":"NO"},0,0,{"$f":"IF(ISERROR(VLOOKUP(A126+8860000,'Growth Data'!A:G,7,0)),0,VLOOKUP(A126+8860000,'Growth Data'!A:G,7,0))","v":0},0]
[3912,"Westlands Primary School, The",0,0,0,0,null,0,0,null,0,0,null,0,0,null,0,0,0,0,0,0,0,null,null,0,60,{"$f":"IF(ISERROR(VLOOKUP(A127+8860000,'Growth Data'!A:F,6,0)),0,VLOOKUP(A127+8860000,'Growth Data'!A:F,6,0))","v":0},60,"YES",{"$f":"IF(ISERROR(VLOOKUP(A127+8860000,'Growth Data'!A:C,3,0)),\"NO\",VLOOKUP(A127+8860000,'Growth Data'!A:C,3,0))","v":"NO"},1,90,{"$f":"IF(ISERROR(VLOOKUP(A127+8860000,'Growth Data'!A:G,7,0)),0,VLOOKUP(A127+8860000,'Growth Data'!A:G,7,0))","v":0},1]
[3914,"Oakfield Primary Academy",4.8099999999999996,4.8100000000000005,0,0,null,0,0,null,0,0,null,0,0,null,0,0,0,0,0,0,0,null,null,0,0,{"$f":"IF(ISERROR(VLOOKUP(A128+8860000,'Growth Data'!A:F,6,0)),0,VLOOKUP(A128+8860000,'Growth Data'!A:F,6,0))","v":0},0,"NO",{"$f":"IF(ISERROR(VLOOKUP(A128+8860000,'Growth Data'!A:C,3,0)),\"NO\",VLOOKUP(A128+8860000,'Growth Data'!A:C,3,0))","v":"NO"},0,0,{"$f":"IF(ISERROR(VLOOKUP(A128+8860000,'Growth Data'!A:G,7,0)),0,VLOOKUP(A128+8860000,'Growth Data'!A:G,7,0))","v":0},0]
[3915,"Manor Community Primary School",4.99,4.99,0,0,null,0,0,null,0,0,null,0,0,null,0,0,0,0,0,0,0,null,null,0,0,{"$f":"IF(ISERROR(VLOOKUP(A129+8860000,'Growth Data'!A:F,6,0)),0,VLOOKUP(A129+8860000,'Growth Data'!A:F,6,0))","v":0},0,"NO",{"$f":"IF(ISERROR(VLOOKUP(A129+8860000,'Growth Data'!A:C,3,0)),\"NO\",VLOOKUP(A129+8860000,'Growth Data'!A:C,3,0))","v":"NO"},0,0,{"$f":"IF(ISERROR(VLOOKUP(A129+8860000,'Growth Data'!A:G,7,0)),0,VLOOKUP(A129+8860000,'Growth Data'!A:G,7,0))","v":0},0]
[4000,"St Augustine Academy",0,0,{"$f":"C130-D130","v":0},0,null,0,0,null,0,0,null,{"$f":"ROUND(L130-M130,2)","v":0},0,null,{"$f":"ROUND(O130-P130,2)","v":0},0,0,{"$f":"ROUND(R130-S130,2)","v":0},0,0,{"$f":"ROUND(U130-V130,2)","v":0},null,null,{"$f":"X130-Y130","v":0},0,{"$f":"IF(ISERROR(VLOOKUP(A130+8860000,'Growth Data'!A:F,6,0)),0,VLOOKUP(A130+8860000,'Growth Data'!A:F,6,0))","v":0},0,"NO",{"$f":"IF(ISERROR(VLOOKUP(A130+8860000,'Growth Data'!A:C,3,0)),\"NO\",VLOOKUP(A130+8860000,'Growth Data'!A:C,3,0))","v":"NO"},{"$f":"IF(AD130=AE130,0,1)","v":0},0,{"$f":"IF(ISERROR(VLOOKUP(A130+8860000,'Growth Data'!A:G,7,0)),0,VLOOKUP(A130+8860000,'Growth Data'!A:G,7,0))","v":0},0]
[4001,"Ebbsfleet Academy, The",0,0,0,0,null,{"$f":"ROUND(F131-G131,2)","v":0},0,null,{"$f":"ROUND(I131-J131,2)","v":0},0,null,0,0,null,0,0,0,0,0,0,0,null,null,0,0,{"$f":"IF(ISERROR(VLOOKUP(A131+8860000,'Growth Data'!A:F,6,0)),0,VLOOKUP(A131+8860000,'Growth Data'!A:F,6,0))","v":0},{"$f":"IF(AD131=\"YES\",AA131-AB131,0)","v":0},"NO",{"$f":"IF(ISERROR(VLOOKUP(A131+8860000,'Growth Data'!A:C,3,0)),\"NO\",VLOOKUP(A131+8860000,'Growth Data'!A:C,3,0))","v":"NO"},0,0,{"$f":"IF(ISERROR(VLOOKUP(A131+8860000,'Growth Data'!A:G,7,0)),0,VLOOKUP(A131+8860000,'Growth Data'!A:G,7,0))","v":0},{"$f":"IF(AG131=AH131,0,1)","v":0}]
[4002,"Sittingbourne Community College",0,0,0,0,null,0,0,null,0,0,null,0,0,null,0,0,0,0,0,0,0,null,null,0,0,{"$f":"IF(ISERROR(VLOOKUP(A132+8860000,'Growth Data'!A:F,6,0)),0,VLOOKUP(A132+8860000,'Growth Data'!A:F,6,0))","v":0},0,"NO",{"$f":"IF(ISERROR(VLOOKUP(A132+8860000,'Growth Data'!A:C,3,0)),\"NO\",VLOOKUP(A132+8860000,'Growth Data'!A:C,3,0))","v":"NO"},0,0,{"$f":"IF(ISERROR(VLOOKUP(A132+8860000,'Growth Data'!A:G,7,0)),0,VLOOKUP(A132+8860000,'Growth Data'!A:G,7,0))","v":0},0]
[4003,"High Weald Academy, The",0,0,0,0,null,0,0,null,0,0,null,0,0,null,0,0,0,0,0,0,0,null,null,0,0,{"$f":"IF(ISERROR(VLOOKUP(A133+8860000,'Growth Data'!A:F,6,0)),0,VLOOKUP(A133+8860000,'Growth Data'!A:F,6,0))","v":0},0,"NO",{"$f":"IF(ISERROR(VLOOKUP(A133+8860000,'Growth Data'!A:C,3,0)),\"NO\",VLOOKUP(A133+8860000,'Growth Data'!A:C,3,0))","v":"NO"},0,0,{"$f":"IF(ISERROR(VLOOKUP(A133+8860000,'Growth Data'!A:G,7,0)),0,VLOOKUP(A133+8860000,'Growth Data'!A:G,7,0))","v":0},0]
[4004,"Meopham School",0,0,0,0,null,0,0,null,0,0,null,0,0,null,0,0,0,0,0,0,0,null,null,0,0,{"$f":"IF(ISERROR(VLOOKUP(A134+8860000,'Growth Data'!A:F,6,0)),0,VLOOKUP(A134+8860000,'Growth Data'!A:F,6,0))","v":0},0,"NO",{"$f":"IF(ISERROR(VLOOKUP(A134+8860000,'Growth Data'!A:C,3,0)),\"NO\",VLOOKUP(A134+8860000,'Growth Data'!A:C,3,0))","v":"NO"},0,0,{"$f":"IF(ISERROR(VLOOKUP(A134+8860000,'Growth Data'!A:G,7,0)),0,VLOOKUP(A134+8860000,'Growth Data'!A:G,7,0))","v":0},0]
[4006,"Trinity School",0,0,0,0,null,0,0,null,0,0,null,0,0,null,0,0,0,0,0,0,0,null,null,0,0,{"$f":"IF(ISERROR(VLOOKUP(A135+8860000,'Growth Data'!A:F,6,0)),0,VLOOKUP(A135+8860000,'Growth Data'!A:F,6,0))","v":0},0,"NO",{"$f":"IF(ISERROR(VLOOKUP(A135+8860000,'Growth Data'!A:C,3,0)),\"NO\",VLOOKUP(A135+8860000,'Growth Data'!A:C,3,0))","v":"NO"},0,0,{"$f":"IF(ISERROR(VLOOKUP(A135+8860000,'Growth Data'!A:G,7,0)),0,VLOOKUP(A135+8860000,'Growth Data'!A:G,7,0))","v":0},0]
[4007,"Wye School",0,0,0,0,null,0,0,null,0,0,null,0,0,null,0,0,0,0,0,0,0,null,null,0,0,{"$f":"IF(ISERROR(VLOOKUP(A136+8860000,'Growth Data'!A:F,6,0)),0,VLOOKUP(A136+8860000,'Growth Data'!A:F,6,0))","v":0},0,"NO",{"$f":"IF(ISERROR(VLOOKUP(A136+8860000,'Growth Data'!A:C,3,0)),\"NO\",VLOOKUP(A136+8860000,'Growth Data'!A:C,3,0))","v":"NO"},0,0,{"$f":"IF(ISERROR(VLOOKUP(A136+8860000,'Growth Data'!A:G,7,0)),0,VLOOKUP(A136+8860000,'Growth Data'!A:G,7,0))","v":0},0]
[4009,"Hadlow Rural Community School",0,0,0,0,null,0,0,null,0,0,null,0,0,null,0,0,327.36409935768461,-327.36,0,286.61812747827179,-286.62,null,null,0,0,{"$f":"IF(ISERROR(VLOOKUP(A137+8860000,'Growth Data'!A:F,6,0)),0,VLOOKUP(A137+8860000,'Growth Data'!A:F,6,0))","v":0},0,"NO",{"$f":"IF(ISERROR(VLOOKUP(A137+8860000,'Growth Data'!A:C,3,0)),\"NO\",VLOOKUP(A137+8860000,'Growth Data'!A:C,3,0))","v":"NO"},0,0,{"$f":"IF(ISERROR(VLOOKUP(A137+8860000,'Growth Data'!A:G,7,0)),0,VLOOKUP(A137+8860000,'Growth Data'!A:G,7,0))","v":0},0]
[4012,"Leigh UTC, The",0,0,0,326.14999999999998,null,326.14999999999998,0,null,0,0,null,0,0,null,0,0,0,0,0,0,0,null,null,0,0,{"$f":"IF(ISERROR(VLOOKUP(A138+8860000,'Growth Data'!A:F,6,0)),0,VLOOKUP(A138+8860000,'Growth Data'!A:F,6,0))","v":0},0,"NO",{"$f":"IF(ISERROR(VLOOKUP(A138+8860000,'Growth Data'!A:C,3,0)),\"NO\",VLOOKUP(A138+8860000,'Growth Data'!A:C,3,0))","v":"NO"},0,0,{"$f":"IF(ISERROR(VLOOKUP(A138+8860000,'Growth Data'!A:G,7,0)),0,VLOOKUP(A138+8860000,'Growth Data'!A:G,7,0))","v":0},0]
[4013,"St Edmund's Catholic School",0,0,0,0,null,0,0,null,0,0,null,0,0,null,0,0,0,0,0,0,0,null,null,0,0,{"$f":"IF(ISERROR(VLOOKUP(A139+8860000,'Growth Data'!A:F,6,0)),0,VLOOKUP(A139+8860000,'Growth Data'!A:F,6,0))","v":0},0,"NO",{"$f":"IF(ISERROR(VLOOKUP(A139+8860000,'Growth Data'!A:C,3,0)),\"NO\",VLOOKUP(A139+8860000,'Growth Data'!A:C,3,0))","v":"NO"},0,0,{"$f":"IF(ISERROR(VLOOKUP(A139+8860000,'Growth Data'!A:G,7,0)),0,VLOOKUP(A139+8860000,'Growth Data'!A:G,7,0))","v":0},0]
[4031,"Orchards Academy",0,0,0,0,null,0,0,null,0,0,null,0,0,null,0,0,0,0,0,0,0,null,null,0,0,{"$f":"IF(ISERROR(VLOOKUP(A140+8860000,'Growth Data'!A:F,6,0)),0,VLOOKUP(A140+8860000,'Growth Data'!A:F,6,0))","v":0},0,"NO",{"$f":"IF(ISERROR(VLOOKUP(A140+8860000,'Growth Data'!A:C,3,0)),\"NO\",VLOOKUP(A140+8860000,'Growth Data'!A:C,3,0))","v":"NO"},0,0,{"$f":"IF(ISERROR(VLOOKUP(A140+8860000,'Growth Data'!A:G,7,0)),0,VLOOKUP(A140+8860000,'Growth Data'!A:G,7,0))","v":0},0]
[4046,"Weald of Kent Grammar School",0,0,0,1512.72,null,1512.72,0,null,0,0,null,0,0,null,0,0,0,0,0,0,0,null,null,0,0,{"$f":"IF(ISERROR(VLOOKUP(A141+8860000,'Growth Data'!A:F,6,0)),0,VLOOKUP(A141+8860000,'Growth Data'!A:F,6,0))","v":0},0,"NO",{"$f":"IF(ISERROR(VLOOKUP(A141+8860000,'Growth Data'!A:C,3,0)),\"NO\",VLOOKUP(A141+8860000,'Growth Data'!A:C,3,0))","v":"NO"},0,0,{"$f":"IF(ISERROR(VLOOKUP(A141+8860000,'Growth Data'!A:G,7,0)),0,VLOOKUP(A141+8860000,'Growth Data'!A:G,7,0))","v":0},0]
[4058,"Invicta Grammar School",0,0,0,0,null,0,0,null,0,0,null,0,0,null,0,0,0,0,0,0,0,null,null,0,0,{"$f":"IF(ISERROR(VLOOKUP(A142+8860000,'Growth Data'!A:F,6,0)),0,VLOOKUP(A142+8860000,'Growth Data'!A:F,6,0))","v":0},0,"NO",{"$f":"IF(ISERROR(VLOOKUP(A142+8860000,'Growth Data'!A:C,3,0)),\"NO\",VLOOKUP(A142+8860000,'Growth Data'!A:C,3,0))","v":"NO"},0,0,{"$f":"IF(ISERROR(VLOOKUP(A142+8860000,'Growth Data'!A:G,7,0)),0,VLOOKUP(A142+8860000,'Growth Data'!A:G,7,0))","v":0},0]
[4080,"Highsted Grammar School",0,0,0,0,null,0,0,null,0,0,null,0,0,null,0,0,0,0,0,0,0,null,null,0,0,{"$f":"IF(ISERROR(VLOOKUP(A143+8860000,'Growth Data'!A:F,6,0)),0,VLOOKUP(A143+8860000,'Growth Data'!A:F,6,0))","v":0},0,"NO",{"$f":"IF(ISERROR(VLOOKUP(A143+8860000,'Growth Data'!A:C,3,0)),\"NO\",VLOOKUP(A143+8860000,'Growth Data'!A:C,3,0))","v":"NO"},0,0,{"$f":"IF(ISERROR(VLOOKUP(A143+8860000,'Growth Data'!A:G,7,0)),0,VLOOKUP(A143+8860000,'Growth Data'!A:G,7,0))","v":0},0]
[4092,"Highworth Grammar School",0,0,0,0,null,0,0,null,0,0,null,0,0,null,0,0,0,0,0,0,0,null,null,0,0,{"$f":"IF(ISERROR(VLOOKUP(A144+8860000,'Growth Data'!A:F,6,0)),0,VLOOKUP(A144+8860000,'Growth Data'!A:F,6,0))","v":0},0,"NO",{"$f":"IF(ISERROR(VLOOKUP(A144+8860000,'Growth Data'!A:C,3,0)),\"NO\",VLOOKUP(A144+8860000,'Growth Data'!A:C,3,0))","v":"NO"},0,0,{"$f":"IF(ISERROR(VLOOKUP(A144+8860000,'Growth Data'!A:G,7,0)),0,VLOOKUP(A144+8860000,'Growth Data'!A:G,7,0))","v":0},0]
[4101,"Harvey Grammar School, The",0,0,0,0,null,0,0,null,0,0,null,0,0,null,0,0,0,0,0,0,0,null,null,0,0,{"$f":"IF(ISERROR(VLOOKUP(A145+8860000,'Growth Data'!A:F,6,0)),0,VLOOKUP(A145+8860000,'Growth Data'!A:F,6,0))","v":0},0,"NO",{"$f":"IF(ISERROR(VLOOKUP(A145+8860000,'Growth Data'!A:C,3,0)),\"NO\",VLOOKUP(A145+8860000,'Growth Data'!A:C,3,0))","v":"NO"},0,0,{"$f":"IF(ISERROR(VLOOKUP(A145+8860000,'Growth Data'!A:G,7,0)),0,VLOOKUP(A145+8860000,'Growth Data'!A:G,7,0))","v":0},0]
[4113,"Astor College",0,0,0,0,null,0,0,null,0,0,null,0,0,null,0,0,0,0,0,0,0,null,null,0,0,{"$f":"IF(ISERROR(VLOOKUP(A146+8860000,'Growth Data'!A:F,6,0)),0,VLOOKUP(A146+8860000,'Growth Data'!A:F,6,0))","v":0},0,"NO",{"$f":"IF(ISERROR(VLOOKUP(A146+8860000,'Growth Data'!A:C,3,0)),\"NO\",VLOOKUP(A146+8860000,'Growth Data'!A:C,3,0))","v":"NO"},0,0,{"$f":"IF(ISERROR(VLOOKUP(A146+8860000,'Growth Data'!A:G,7,0)),0,VLOOKUP(A146+8860000,'Growth Data'!A:G,7,0))","v":0},0]
[4120,"King Ethelbert School",0,0,0,0,null,0,0,null,0,0,null,0,0,null,0,0,0,0,0,0,0,null,null,0,0,{"$f":"IF(ISERROR(VLOOKUP(A147+8860000,'Growth Data'!A:F,6,0)),0,VLOOKUP(A147+8860000,'Growth Data'!A:F,6,0))","v":0},0,"NO",{"$f":"IF(ISERROR(VLOOKUP(A147+8860000,'Growth Data'!A:C,3,0)),\"NO\",VLOOKUP(A147+8860000,'Growth Data'!A:C,3,0))","v":"NO"},0,0,{"$f":"IF(ISERROR(VLOOKUP(A147+8860000,'Growth Data'!A:G,7,0)),0,VLOOKUP(A147+8860000,'Growth Data'!A:G,7,0))","v":0},0]
[4172,"Hartsdown Academy",0,0,0,0,null,0,0,null,0,0,null,0,0,null,0,0,0,0,0,0,0,null,null,0,0,{"$f":"IF(ISERROR(VLOOKUP(A148+8860000,'Growth Data'!A:F,6,0)),0,VLOOKUP(A148+8860000,'Growth Data'!A:F,6,0))","v":0},0,"NO",{"$f":"IF(ISERROR(VLOOKUP(A148+8860000,'Growth Data'!A:C,3,0)),\"NO\",VLOOKUP(A148+8860000,'Growth Data'!A:C,3,0))","v":"NO"},0,0,{"$f":"IF(ISERROR(VLOOKUP(A148+8860000,'Growth Data'!A:G,7,0)),0,VLOOKUP(A148+8860000,'Growth Data'!A:G,7,0))","v":0},0]
[4196,"Towers School and Sixth Form Centre, The",0,0,0,0,null,0,0,null,0,0,null,0,0,null,0,0,0,0,0,0,0,null,null,0,0,{"$f":"IF(ISERROR(VLOOKUP(A149+8860000,'Growth Data'!A:F,6,0)),0,VLOOKUP(A149+8860000,'Growth Data'!A:F,6,0))","v":0},0,"NO",{"$f":"IF(ISERROR(VLOOKUP(A149+8860000,'Growth Data'!A:C,3,0)),\"NO\",VLOOKUP(A149+8860000,'Growth Data'!A:C,3,0))","v":"NO"},0,0,{"$f":"IF(ISERROR(VLOOKUP(A149+8860000,'Growth Data'!A:G,7,0)),0,VLOOKUP(A149+8860000,'Growth Data'!A:G,7,0))","v":0},0]
[4207,"Goodwin Academy",0,0,0,0,null,0,0,null,0,0,null,0,0,null,0,0,0,0,0,0,0,null,null,0,0,{"$f":"IF(ISERROR(VLOOKUP(A150+8860000,'Growth Data'!A:F,6,0)),0,VLOOKUP(A150+8860000,'Growth Data'!A:F,6,0))","v":0},0,"NO",{"$f":"IF(ISERROR(VLOOKUP(A150+8860000,'Growth Data'!A:C,3,0)),\"NO\",VLOOKUP(A150+8860000,'Growth Data'!A:C,3,0))","v":"NO"},0,0,{"$f":"IF(ISERROR(VLOOKUP(A150+8860000,'Growth Data'!A:G,7,0)),0,VLOOKUP(A150+8860000,'Growth Data'!A:G,7,0))","v":0},0]
[4242,"Abbey School",0,0,0,0,null,0,0,null,0,0,null,0,0,null,0,0,0,0,0,0,0,null,null,0,0,{"$f":"IF(ISERROR(VLOOKUP(A151+8860000,'Growth Data'!A:F,6,0)),0,VLOOKUP(A151+8860000,'Growth Data'!A:F,6,0))","v":0},0,"NO",{"$f":"IF(ISERROR(VLOOKUP(A151+8860000,'Growth Data'!A:C,3,0)),\"NO\",VLOOKUP(A151+8860000,'Growth Data'!A:C,3,0))","v":"NO"},0,0,{"$f":"IF(ISERROR(VLOOKUP(A151+8860000,'Growth Data'!A:G,7,0)),0,VLOOKUP(A151+8860000,'Growth Data'!A:G,7,0))","v":0},0]
[4249,"Valley Park School",0,0,0,0,null,0,0,null,0,0,null,0,0,null,0,0,0,0,0,0,0,null,null,0,0,{"$f":"IF(ISERROR(VLOOKUP(A152+8860000,'Growth Data'!A:F,6,0)),0,VLOOKUP(A152+8860000,'Growth Data'!A:F,6,0))","v":0},0,"NO",{"$f":"IF(ISERROR(VLOOKUP(A152+8860000,'Growth Data'!A:C,3,0)),\"NO\",VLOOKUP(A152+8860000,'Growth Data'!A:C,3,0))","v":"NO"},0,0,{"$f":"IF(ISERROR(VLOOKUP(A152+8860000,'Growth Data'!A:G,7,0)),0,VLOOKUP(A152+8860000,'Growth Data'!A:G,7,0))","v":0},0]
[4527,"Borden Grammar School",0,0,0,0,null,0,0,null,0,0,null,0,0,null,0,0,0,0,0,0,0,null,null,0,0,{"$f":"IF(ISERROR(VLOOKUP(A153+8860000,'Growth Data'!A:F,6,0)),0,VLOOKUP(A153+8860000,'Growth Data'!A:F,6,0))","v":0},0,"NO",{"$f":"IF(ISERROR(VLOOKUP(A153+8860000,'Growth Data'!A:C,3,0)),\"NO\",VLOOKUP(A153+8860000,'Growth Data'!A:C,3,0))","v":"NO"},0,0,{"$f":"IF(ISERROR(VLOOKUP(A153+8860000,'Growth Data'!A:G,7,0)),0,VLOOKUP(A153+8860000,'Growth Data'!A:G,7,0))","v":0},0]
[4528,"Norton Knatchbull School, The",0,0,0,0,null,0,0,null,0,0,null,0,0,null,0,0,0,0,0,0,0,null,null,0,0,{"$f":"IF(ISERROR(VLOOKUP(A154+8860000,'Growth Data'!A:F,6,0)),0,VLOOKUP(A154+8860000,'Growth Data'!A:F,6,0))","v":0},0,"NO",{"$f":"IF(ISERROR(VLOOKUP(A154+8860000,'Growth Data'!A:C,3,0)),\"NO\",VLOOKUP(A154+8860000,'Growth Data'!A:C,3,0))","v":"NO"},0,0,{"$f":"IF(ISERROR(VLOOKUP(A154+8860000,'Growth Data'!A:G,7,0)),0,VLOOKUP(A154+8860000,'Growth Data'!A:G,7,0))","v":0},0]
[4633,"Ursuline College",0,0,0,0,null,0,0,null,0,0,null,0,0,null,0,0,0,0,0,0,0,null,null,0,0,{"$f":"IF(ISERROR(VLOOKUP(A155+8860000,'Growth Data'!A:F,6,0)),0,VLOOKUP(A155+8860000,'Growth Data'!A:F,6,0))","v":0},0,"NO",{"$f":"IF(ISERROR(VLOOKUP(A155+8860000,'Growth Data'!A:C,3,0)),\"NO\",VLOOKUP(A155+8860000,'Growth Data'!A:C,3,0))","v":"NO"},0,0,{"$f":"IF(ISERROR(VLOOKUP(A155+8860000,'Growth Data'!A:G,7,0)),0,VLOOKUP(A155+8860000,'Growth Data'!A:G,7,0))","v":0},0]
[5209,"Allington Primary School",0,0,0,1061.75,null,1061.75,0,null,0,0,null,0,0,null,0,0,0,0,0,0,0,null,null,0,0,{"$f":"IF(ISERROR(VLOOKUP(A156+8860000,'Growth Data'!A:F,6,0)),0,VLOOKUP(A156+8860000,'Growth Data'!A:F,6,0))","v":0},0,"NO",{"$f":"IF(ISERROR(VLOOKUP(A156+8860000,'Growth Data'!A:C,3,0)),\"NO\",VLOOKUP(A156+8860000,'Growth Data'!A:C,3,0))","v":"NO"},0,0,{"$f":"IF(ISERROR(VLOOKUP(A156+8860000,'Growth Data'!A:G,7,0)),0,VLOOKUP(A156+8860000,'Growth Data'!A:G,7,0))","v":0},0]
[5210,"St Botolph's CEP School",0,0,0,0,null,0,0,null,0,0,null,0,0,null,0,0,0,0,0,0,0,null,null,0,30,{"$f":"IF(ISERROR(VLOOKUP(A157+8860000,'Growth Data'!A:F,6,0)),0,VLOOKUP(A157+8860000,'Growth Data'!A:F,6,0))","v":0},30,"YES",{"$f":"IF(ISERROR(VLOOKUP(A157+8860000,'Growth Data'!A:C,3,0)),\"NO\",VLOOKUP(A157+8860000,'Growth Data'!A:C,3,0))","v":"NO"},1,60,{"$f":"IF(ISERROR(VLOOKUP(A157+8860000,'Growth Data'!A:G,7,0)),0,VLOOKUP(A157+8860000,'Growth Data'!A:G,7,0))","v":0},1]
[5216,"Stella Maris Catholic Primary School",0,0,0,0,null,0,0,null,0,0,null,0,0,null,0,0,0,0,0,0,0,null,null,0,0,{"$f":"IF(ISERROR(VLOOKUP(A158+8860000,'Growth Data'!A:F,6,0)),0,VLOOKUP(A158+8860000,'Growth Data'!A:F,6,0))","v":0},0,"NO",{"$f":"IF(ISERROR(VLOOKUP(A158+8860000,'Growth Data'!A:C,3,0)),\"NO\",VLOOKUP(A158+8860000,'Growth Data'!A:C,3,0))","v":"NO"},0,0,{"$f":"IF(ISERROR(VLOOKUP(A158+8860000,'Growth Data'!A:G,7,0)),0,VLOOKUP(A158+8860000,'Growth Data'!A:G,7,0))","v":0},0]
[5217,"Our Lady of Hartley Catholic Primary School",0,0,0,1689.89,null,1689.89,0,null,0,0,null,0,0,null,0,0,0,0,0,0,0,null,null,0,0,{"$f":"IF(ISERROR(VLOOKUP(A159+8860000,'Growth Data'!A:F,6,0)),0,VLOOKUP(A159+8860000,'Growth Data'!A:F,6,0))","v":0},0,"NO",{"$f":"IF(ISERROR(VLOOKUP(A159+8860000,'Growth Data'!A:C,3,0)),\"NO\",VLOOKUP(A159+8860000,'Growth Data'!A:C,3,0))","v":"NO"},0,0,{"$f":"IF(ISERROR(VLOOKUP(A159+8860000,'Growth Data'!A:G,7,0)),0,VLOOKUP(A159+8860000,'Growth Data'!A:G,7,0))","v":0},0]
[5219,"Wilmington Primary School",0,0,0,1230.93,null,1230.93,0,null,0,0,null,0,0,null,0,0,0,0,0,0,0,null,null,0,0,{"$f":"IF(ISERROR(VLOOKUP(A160+8860000,'Growth Data'!A:F,6,0)),0,VLOOKUP(A160+8860000,'Growth Data'!A:F,6,0))","v":0},0,"NO",{"$f":"IF(ISERROR(VLOOKUP(A160+8860000,'Growth Data'!A:C,3,0)),\"NO\",VLOOKUP(A160+8860000,'Growth Data'!A:C,3,0))","v":"NO"},0,0,{"$f":"IF(ISERROR(VLOOKUP(A160+8860000,'Growth Data'!A:G,7,0)),0,VLOOKUP(A160+8860000,'Growth Data'!A:G,7,0))","v":0},0]
[5220,"Halfway Houses Primary School",0,0,0,0,null,0,0,null,0,0,null,0,0,null,0,0,0,0,0,0,0,null,null,0,61,{"$f":"IF(ISERROR(VLOOKUP(A161+8860000,'Growth Data'!A:F,6,0)),0,VLOOKUP(A161+8860000,'Growth Data'!A:F,6,0))","v":60},1,"YES",{"$f":"IF(ISERROR(VLOOKUP(A161+8860000,'Growth Data'!A:C,3,0)),\"NO\",VLOOKUP(A161+8860000,'Growth Data'!A:C,3,0))","v":"YES"},0,90,{"$f":"IF(ISERROR(VLOOKUP(A161+8860000,'Growth Data'!A:G,7,0)),0,VLOOKUP(A161+8860000,'Growth Data'!A:G,7,0))","v":90},0]
[5222,"St Joseph's Catholic Primary School, Northfleet",0,0,{"$f":"C162-D162","v":0},0,null,0,0,null,0,0,null,{"$f":"ROUND(L162-M162,2)","v":0},0,null,{"$f":"ROUND(O162-P162,2)","v":0},0,0,{"$f":"ROUND(R162-S162,2)","v":0},0,0,{"$f":"ROUND(U162-V162,2)","v":0},null,null,{"$f":"X162-Y162","v":0},0,{"$f":"IF(ISERROR(VLOOKUP(A162+8860000,'Growth Data'!A:F,6,0)),0,VLOOKUP(A162+8860000,'Growth Data'!A:F,6,0))","v":0},0,"NO",{"$f":"IF(ISERROR(VLOOKUP(A162+8860000,'Growth Data'!A:C,3,0)),\"NO\",VLOOKUP(A162+8860000,'Growth Data'!A:C,3,0))","v":"NO"},{"$f":"IF(AD162=AE162,0,1)","v":0},0,{"$f":"IF(ISERROR(VLOOKUP(A162+8860000,'Growth Data'!A:G,7,0)),0,VLOOKUP(A162+8860000,'Growth Data'!A:G,7,0))","v":0},0]
[5228,"St George's Church of England Primary School",0,0,0,0,null,0,0,null,0,0,null,0,0,null,0,0,0,0,0,0,0,null,null,0,0,{"$f":"IF(ISERROR(VLOOKUP(A163+8860000,'Growth Data'!A:F,6,0)),0,VLOOKUP(A163+8860000,'Growth Data'!A:F,6,0))","v":0},0,"NO",{"$f":"IF(ISERROR(VLOOKUP(A163+8860000,'Growth Data'!A:C,3,0)),\"NO\",VLOOKUP(A163+8860000,'Growth Data'!A:C,3,0))","v":"NO"},0,0,{"$f":"IF(ISERROR(VLOOKUP(A163+8860000,'Growth Data'!A:G,7,0)),0,VLOOKUP(A163+8860000,'Growth Data'!A:G,7,0))","v":0},0]
[5400,"Wilmington Grammar School for Girls",0,0,0,0,null,0,0,null,0,0,null,0,0,null,0,0,0,0,0,0,0,null,null,0,0,{"$f":"IF(ISERROR(VLOOKUP(A164+8860000,'Growth Data'!A:F,6,0)),0,VLOOKUP(A164+8860000,'Growth Data'!A:F,6,0))","v":120},0,"NO",{"$f":"IF(ISERROR(VLOOKUP(A164+8860000,'Growth Data'!A:C,3,0)),\"NO\",VLOOKUP(A164+8860000,'Growth Data'!A:C,3,0))","v":"YES"},1,0,{"$f":"IF(ISERROR(VLOOKUP(A164+8860000,'Growth Data'!A:G,7,0)),0,VLOOKUP(A164+8860000,'Growth Data'!A:G,7,0))","v":150},1]
[5401,"Maplesden Noakes School, The",0,0,0,0,null,0,0,null,0,0,null,0,0,null,0,0,0,0,0,0,0,null,null,0,0,{"$f":"IF(ISERROR(VLOOKUP(A165+8860000,'Growth Data'!A:F,6,0)),0,VLOOKUP(A165+8860000,'Growth Data'!A:F,6,0))","v":0},0,"NO",{"$f":"IF(ISERROR(VLOOKUP(A165+8860000,'Growth Data'!A:C,3,0)),\"NO\",VLOOKUP(A165+8860000,'Growth Data'!A:C,3,0))","v":"NO"},0,0,{"$f":"IF(ISERROR(VLOOKUP(A165+8860000,'Growth Data'!A:G,7,0)),0,VLOOKUP(A165+8860000,'Growth Data'!A:G,7,0))","v":0},0]
[5403,"Wilmington Grammar School for Boys",0,0,0,0,null,0,0,null,0,0,null,0,0,null,0,0,0,0,0,0,0,null,null,0,0,{"$f":"IF(ISERROR(VLOOKUP(A166+8860000,'Growth Data'!A:F,6,0)),0,VLOOKUP(A166+8860000,'Growth Data'!A:F,6,0))","v":148},0,"NO",{"$f":"IF(ISERROR(VLOOKUP(A166+8860000,'Growth Data'!A:C,3,0)),\"NO\",VLOOKUP(A166+8860000,'Growth Data'!A:C,3,0))","v":"YES"},1,0,{"$f":"IF(ISERROR(VLOOKUP(A166+8860000,'Growth Data'!A:G,7,0)),0,VLOOKUP(A166+8860000,'Growth Data'!A:G,7,0))","v":150},1]
[5404,"Saint George's CE School",0,0,0,0,null,0,0,null,0,0,null,0,0,null,0,0,0,0,0,0,0,null,null,0,0,{"$f":"IF(ISERROR(VLOOKUP(A167+8860000,'Growth Data'!A:F,6,0)),0,VLOOKUP(A167+8860000,'Growth Data'!A:F,6,0))","v":0},0,"NO",{"$f":"IF(ISERROR(VLOOKUP(A167+8860000,'Growth Data'!A:C,3,0)),\"NO\",VLOOKUP(A167+8860000,'Growth Data'!A:C,3,0))","v":"NO"},0,0,{"$f":"IF(ISERROR(VLOOKUP(A167+8860000,'Growth Data'!A:G,7,0)),0,VLOOKUP(A167+8860000,'Growth Data'!A:G,7,0))","v":0},0]
[5406,"Dartford Grammar School",0,0,0,0,null,0,0,null,0,0,null,0,0,null,0,0,0,0,0,0,0,null,null,0,0,{"$f":"IF(ISERROR(VLOOKUP(A168+8860000,'Growth Data'!A:F,6,0)),0,VLOOKUP(A168+8860000,'Growth Data'!A:F,6,0))","v":0},0,"NO",{"$f":"IF(ISERROR(VLOOKUP(A168+8860000,'Growth Data'!A:C,3,0)),\"NO\",VLOOKUP(A168+8860000,'Growth Data'!A:C,3,0))","v":"NO"},0,0,{"$f":"IF(ISERROR(VLOOKUP(A168+8860000,'Growth Data'!A:G,7,0)),0,VLOOKUP(A168+8860000,'Growth Data'!A:G,7,0))","v":0},0]
[5408,"Homewood School and Sixth Form Centre",0,0,0,0,null,0,0,null,0,0,null,0,0,null,0,0,0,0,0,0,0,null,null,0,0,{"$f":"IF(ISERROR(VLOOKUP(A169+8860000,'Growth Data'!A:F,6,0)),0,VLOOKUP(A169+8860000,'Growth Data'!A:F,6,0))","v":0},0,"NO",{"$f":"IF(ISERROR(VLOOKUP(A169+8860000,'Growth Data'!A:C,3,0)),\"NO\",VLOOKUP(A169+8860000,'Growth Data'!A:C,3,0))","v":"NO"},0,0,{"$f":"IF(ISERROR(VLOOKUP(A169+8860000,'Growth Data'!A:G,7,0)),0,VLOOKUP(A169+8860000,'Growth Data'!A:G,7,0))","v":0},0]
[5409,"Wrotham School",0,0,{"$f":"C170-D170","v":0},0,null,{"$f":"ROUND(F170-G170,2)","v":0},0,null,{"$f":"ROUND(I170-J170,2)","v":0},0,null,{"$f":"ROUND(L170-M170,2)","v":0},0,null,{"$f":"ROUND(O170-P170,2)","v":0},0,0,{"$f":"ROUND(R170-S170,2)","v":0},0,0,{"$f":"ROUND(U170-V170,2)","v":0},null,null,{"$f":"X170-Y170","v":0},0,{"$f":"IF(ISERROR(VLOOKUP(A170+8860000,'Growth Data'!A:F,6,0)),0,VLOOKUP(A170+8860000,'Growth Data'!A:F,6,0))","v":0},{"$f":"IF(AD170=\"YES\",AA170-AB170,0)","v":0},"NO",{"$f":"IF(ISERROR(VLOOKUP(A170+8860000,'Growth Data'!A:C,3,0)),\"NO\",VLOOKUP(A170+8860000,'Growth Data'!A:C,3,0))","v":"NO"},{"$f":"IF(AD170=AE170,0,1)","v":0},0,{"$f":"IF(ISERROR(VLOOKUP(A170+8860000,'Growth Data'!A:G,7,0)),0,VLOOKUP(A170+8860000,'Growth Data'!A:G,7,0))","v":0},0]
[5414,"Fulston Manor School",0,0,0,0,null,0,0,null,0,0,null,0,0,null,0,0,null,0,0,null,0,null,null,0,0,{"$f":"IF(ISERROR(VLOOKUP(A171+8860000,'Growth Data'!A:F,6,0)),0,VLOOKUP(A171+8860000,'Growth Data'!A:F,6,0))","v":0},0,"NO",{"$f":"IF(ISERROR(VLOOKUP(A171+8860000,'Growth Data'!A:C,3,0)),\"NO\",VLOOKUP(A171+8860000,'Growth Data'!A:C,3,0))","v":"NO"},0,0,{"$f":"IF(ISERROR(VLOOKUP(A171+8860000,'Growth Data'!A:G,7,0)),0,VLOOKUP(A171+8860000,'Growth Data'!A:G,7,0))","v":0},0]
[5416,"Cranbrook School",0,0,0,0,null,0,0,null,0,0,null,0,0,null,0,0,null,0,0,null,0,null,null,0,0,{"$f":"IF(ISERROR(VLOOKUP(A172+8860000,'Growth Data'!A:F,6,0)),0,VLOOKUP(A172+8860000,'Growth Data'!A:F,6,0))","v":0},0,"NO",{"$f":"IF(ISERROR(VLOOKUP(A172+8860000,'Growth Data'!A:C,3,0)),\"NO\",VLOOKUP(A172+8860000,'Growth Data'!A:C,3,0))","v":"NO"},0,0,{"$f":"IF(ISERROR(VLOOKUP(A172+8860000,'Growth Data'!A:G,7,0)),0,VLOOKUP(A172+8860000,'Growth Data'!A:G,7,0))","v":0},0]
[5418,"Skinners' School, The",0,0,0,0,null,0,0,null,0,0,null,0,0,null,0,0,null,0,0,null,0,null,null,0,0,{"$f":"IF(ISERROR(VLOOKUP(A173+8860000,'Growth Data'!A:F,6,0)),0,VLOOKUP(A173+8860000,'Growth Data'!A:F,6,0))","v":0},0,"NO",{"$f":"IF(ISERROR(VLOOKUP(A173+8860000,'Growth Data'!A:C,3,0)),\"NO\",VLOOKUP(A173+8860000,'Growth Data'!A:C,3,0))","v":"NO"},0,0,{"$f":"IF(ISERROR(VLOOKUP(A173+8860000,'Growth Data'!A:G,7,0)),0,VLOOKUP(A173+8860000,'Growth Data'!A:G,7,0))","v":0},0]
[5421,"Canterbury Academy, The",0,0,0,0,null,0,0,null,0,0,null,0,0,null,0,0,null,0,0,null,0,null,null,0,0,{"$f":"IF(ISERROR(VLOOKUP(A174+8860000,'Growth Data'!A:F,6,0)),0,VLOOKUP(A174+8860000,'Growth Data'!A:F,6,0))","v":0},0,"NO",{"$f":"IF(ISERROR(VLOOKUP(A174+8860000,'Growth Data'!A:C,3,0)),\"NO\",VLOOKUP(A174+8860000,'Growth Data'!A:C,3,0))","v":"NO"},0,0,{"$f":"IF(ISERROR(VLOOKUP(A174+8860000,'Growth Data'!A:G,7,0)),0,VLOOKUP(A174+8860000,'Growth Data'!A:G,7,0))","v":0},0]
[5422,"Oakwood Park Grammar School, Maidstone",0,0,0,0,null,0,0,null,0,0,null,0,0,null,0,0,null,0,0,null,0,null,null,0,0,{"$f":"IF(ISERROR(VLOOKUP(A175+8860000,'Growth Data'!A:F,6,0)),0,VLOOKUP(A175+8860000,'Growth Data'!A:F,6,0))","v":0},0,"NO",{"$f":"IF(ISERROR(VLOOKUP(A175+8860000,'Growth Data'!A:C,3,0)),\"NO\",VLOOKUP(A175+8860000,'Growth Data'!A:C,3,0))","v":"NO"},0,0,{"$f":"IF(ISERROR(VLOOKUP(A175+8860000,'Growth Data'!A:G,7,0)),0,VLOOKUP(A175+8860000,'Growth Data'!A:G,7,0))","v":0},0]
[5428,"Sir Roger Manwood's School",0,0,0,0,null,0,0,null,0,0,null,0,0,null,0,0,null,0,0,null,0,null,null,0,0,{"$f":"IF(ISERROR(VLOOKUP(A176+8860000,'Growth Data'!A:F,6,0)),0,VLOOKUP(A176+8860000,'Growth Data'!A:F,6,0))","v":0},0,"NO",{"$f":"IF(ISERROR(VLOOKUP(A176+8860000,'Growth Data'!A:C,3,0)),\"NO\",VLOOKUP(A176+8860000,'Growth Data'!A:C,3,0))","v":"NO"},0,0,{"$f":"IF(ISERROR(VLOOKUP(A176+8860000,'Growth Data'!A:G,7,0)),0,VLOOKUP(A176+8860000,'Growth Data'!A:G,7,0))","v":0},0]
[5432,"St Simon Stock Catholic School, Maidstone",0,0,0,0,null,0,0,null,0,0,null,0,0,null,0,0,null,0,0,null,0,null,null,0,0,{"$f":"IF(ISERROR(VLOOKUP(A177+8860000,'Growth Data'!A:F,6,0)),0,VLOOKUP(A177+8860000,'Growth Data'!A:F,6,0))","v":0},0,"NO",{"$f":"IF(ISERROR(VLOOKUP(A177+8860000,'Growth Data'!A:C,3,0)),\"NO\",VLOOKUP(A177+8860000,'Growth Data'!A:C,3,0))","v":"NO"},0,0,{"$f":"IF(ISERROR(VLOOKUP(A177+8860000,'Growth Data'!A:G,7,0)),0,VLOOKUP(A177+8860000,'Growth Data'!A:G,7,0))","v":0},0]
[5434,"Westlands School, The",0,0,0,0,null,0,0,null,0,0,null,0,0,null,0,0,null,0,0,null,0,null,null,0,0,{"$f":"IF(ISERROR(VLOOKUP(A178+8860000,'Growth Data'!A:F,6,0)),0,VLOOKUP(A178+8860000,'Growth Data'!A:F,6,0))","v":0},0,"NO",{"$f":"IF(ISERROR(VLOOKUP(A178+8860000,'Growth Data'!A:C,3,0)),\"NO\",VLOOKUP(A178+8860000,'Growth Data'!A:C,3,0))","v":"NO"},0,0,{"$f":"IF(ISERROR(VLOOKUP(A178+8860000,'Growth Data'!A:G,7,0)),0,VLOOKUP(A178+8860000,'Growth Data'!A:G,7,0))","v":0},0]
[5435,"St Gregory's Catholic School",0,0,0,0,null,0,0,null,0,0,null,0,0,null,0,0,null,0,0,null,0,null,null,0,0,{"$f":"IF(ISERROR(VLOOKUP(A179+8860000,'Growth Data'!A:F,6,0)),0,VLOOKUP(A179+8860000,'Growth Data'!A:F,6,0))","v":0},0,"NO",{"$f":"IF(ISERROR(VLOOKUP(A179+8860000,'Growth Data'!A:C,3,0)),\"NO\",VLOOKUP(A179+8860000,'Growth Data'!A:C,3,0))","v":"NO"},0,0,{"$f":"IF(ISERROR(VLOOKUP(A179+8860000,'Growth Data'!A:G,7,0)),0,VLOOKUP(A179+8860000,'Growth Data'!A:G,7,0))","v":0},0]
[5437,"Folkestone School for Girls, The",0,0,0,0,null,0,0,null,0,0,null,0,0,null,0,0,null,0,0,null,0,null,null,0,0,{"$f":"IF(ISERROR(VLOOKUP(A180+8860000,'Growth Data'!A:F,6,0)),0,VLOOKUP(A180+8860000,'Growth Data'!A:F,6,0))","v":0},0,"NO",{"$f":"IF(ISERROR(VLOOKUP(A180+8860000,'Growth Data'!A:C,3,0)),\"NO\",VLOOKUP(A180+8860000,'Growth Data'!A:C,3,0))","v":"NO"},0,0,{"$f":"IF(ISERROR(VLOOKUP(A180+8860000,'Growth Data'!A:G,7,0)),0,VLOOKUP(A180+8860000,'Growth Data'!A:G,7,0))","v":0},0]
[5439,"Mascalls Academy",0,0,0,0,null,0,0,null,0,0,null,0,0,null,0,0,null,0,0,null,0,null,null,0,0,{"$f":"IF(ISERROR(VLOOKUP(A181+8860000,'Growth Data'!A:F,6,0)),0,VLOOKUP(A181+8860000,'Growth Data'!A:F,6,0))","v":0},0,"NO",{"$f":"IF(ISERROR(VLOOKUP(A181+8860000,'Growth Data'!A:C,3,0)),\"NO\",VLOOKUP(A181+8860000,'Growth Data'!A:C,3,0))","v":"NO"},0,0,{"$f":"IF(ISERROR(VLOOKUP(A181+8860000,'Growth Data'!A:G,7,0)),0,VLOOKUP(A181+8860000,'Growth Data'!A:G,7,0))","v":0},0]
[5443,"Tonbridge Grammar School",0,0,0,2881.38,null,2881.38,0,null,0,0,null,0,0,null,0,0,null,0,0,null,0,null,null,0,0,{"$f":"IF(ISERROR(VLOOKUP(A182+8860000,'Growth Data'!A:F,6,0)),0,VLOOKUP(A182+8860000,'Growth Data'!A:F,6,0))","v":0},0,"NO",{"$f":"IF(ISERROR(VLOOKUP(A182+8860000,'Growth Data'!A:C,3,0)),\"NO\",VLOOKUP(A182+8860000,'Growth Data'!A:C,3,0))","v":"NO"},0,0,{"$f":"IF(ISERROR(VLOOKUP(A182+8860000,'Growth Data'!A:G,7,0)),0,VLOOKUP(A182+8860000,'Growth Data'!A:G,7,0))","v":0},0]
[5444,"Barton Court Grammar School",0,0,0,0,null,0,0,null,0,0,null,0,0,null,0,0,null,0,0,null,0,null,null,0,0,{"$f":"IF(ISERROR(VLOOKUP(A183+8860000,'Growth Data'!A:F,6,0)),0,VLOOKUP(A183+8860000,'Growth Data'!A:F,6,0))","v":0},0,"NO",{"$f":"IF(ISERROR(VLOOKUP(A183+8860000,'Growth Data'!A:C,3,0)),\"NO\",VLOOKUP(A183+8860000,'Growth Data'!A:C,3,0))","v":"NO"},0,0,{"$f":"IF(ISERROR(VLOOKUP(A183+8860000,'Growth Data'!A:G,7,0)),0,VLOOKUP(A183+8860000,'Growth Data'!A:G,7,0))","v":0},0]
[5446,"St Anselm's Catholic School, Canterbury",0,0,0,0,null,0,0,null,0,0,null,0,0,null,0,0,null,0,0,null,0,null,null,0,0,{"$f":"IF(ISERROR(VLOOKUP(A184+8860000,'Growth Data'!A:F,6,0)),0,VLOOKUP(A184+8860000,'Growth Data'!A:F,6,0))","v":0},0,"NO",{"$f":"IF(ISERROR(VLOOKUP(A184+8860000,'Growth Data'!A:C,3,0)),\"NO\",VLOOKUP(A184+8860000,'Growth Data'!A:C,3,0))","v":"NO"},0,0,{"$f":"IF(ISERROR(VLOOKUP(A184+8860000,'Growth Data'!A:G,7,0)),0,VLOOKUP(A184+8860000,'Growth Data'!A:G,7,0))","v":0},0]
[5448,"Herne Bay High School",0,0,0,0,null,0,0,null,0,0,null,0,0,null,0,0,null,0,0,null,0,null,null,0,0,{"$f":"IF(ISERROR(VLOOKUP(A185+8860000,'Growth Data'!A:F,6,0)),0,VLOOKUP(A185+8860000,'Growth Data'!A:F,6,0))","v":0},0,"NO",{"$f":"IF(ISERROR(VLOOKUP(A185+8860000,'Growth Data'!A:C,3,0)),\"NO\",VLOOKUP(A185+8860000,'Growth Data'!A:C,3,0))","v":"NO"},0,0,{"$f":"IF(ISERROR(VLOOKUP(A185+8860000,'Growth Data'!A:G,7,0)),0,VLOOKUP(A185+8860000,'Growth Data'!A:G,7,0))","v":0},0]
[5449,"Queen Elizabeth's Grammar School",0,0,0,0,null,0,0,null,0,0,null,0,0,null,0,0,null,0,0,null,0,null,null,0,0,{"$f":"IF(ISERROR(VLOOKUP(A186+8860000,'Growth Data'!A:F,6,0)),0,VLOOKUP(A186+8860000,'Growth Data'!A:F,6,0))","v":0},0,"NO",{"$f":"IF(ISERROR(VLOOKUP(A186+8860000,'Growth Data'!A:C,3,0)),\"NO\",VLOOKUP(A186+8860000,'Growth Data'!A:C,3,0))","v":"NO"},0,0,{"$f":"IF(ISERROR(VLOOKUP(A186+8860000,'Growth Data'!A:G,7,0)),0,VLOOKUP(A186+8860000,'Growth Data'!A:G,7,0))","v":0},0]
[5450,"Hillview School for Girls",0,0,0,0,null,0,0,null,0,0,null,0,0,null,0,0,null,0,0,null,0,null,null,0,0,{"$f":"IF(ISERROR(VLOOKUP(A187+8860000,'Growth Data'!A:F,6,0)),0,VLOOKUP(A187+8860000,'Growth Data'!A:F,6,0))","v":0},0,"NO",{"$f":"IF(ISERROR(VLOOKUP(A187+8860000,'Growth Data'!A:C,3,0)),\"NO\",VLOOKUP(A187+8860000,'Growth Data'!A:C,3,0))","v":"NO"},0,0,{"$f":"IF(ISERROR(VLOOKUP(A187+8860000,'Growth Data'!A:G,7,0)),0,VLOOKUP(A187+8860000,'Growth Data'!A:G,7,0))","v":0},0]
[5455,"Hayesbrook School, The",0,0,0,0,null,0,0,null,0,0,null,0,0,null,0,0,null,0,0,null,0,null,null,0,0,{"$f":"IF(ISERROR(VLOOKUP(A188+8860000,'Growth Data'!A:F,6,0)),0,VLOOKUP(A188+8860000,'Growth Data'!A:F,6,0))","v":0},0,"NO",{"$f":"IF(ISERROR(VLOOKUP(A188+8860000,'Growth Data'!A:C,3,0)),\"NO\",VLOOKUP(A188+8860000,'Growth Data'!A:C,3,0))","v":"NO"},0,0,{"$f":"IF(ISERROR(VLOOKUP(A188+8860000,'Growth Data'!A:G,7,0)),0,VLOOKUP(A188+8860000,'Growth Data'!A:G,7,0))","v":0},0]
[5460,"Dane Court Grammar School",0,0,0,0,null,0,0,null,0,0,null,0,0,null,0,0,null,0,0,null,0,null,null,0,0,{"$f":"IF(ISERROR(VLOOKUP(A189+8860000,'Growth Data'!A:F,6,0)),0,VLOOKUP(A189+8860000,'Growth Data'!A:F,6,0))","v":0},0,"NO",{"$f":"IF(ISERROR(VLOOKUP(A189+8860000,'Growth Data'!A:C,3,0)),\"NO\",VLOOKUP(A189+8860000,'Growth Data'!A:C,3,0))","v":"NO"},0,0,{"$f":"IF(ISERROR(VLOOKUP(A189+8860000,'Growth Data'!A:G,7,0)),0,VLOOKUP(A189+8860000,'Growth Data'!A:G,7,0))","v":0},0]
[5462,"Chatham & Clarendon Grammar School",0,0,0,0,null,0,0,null,0,0,null,0,0,null,0,0,null,0,0,null,0,null,null,0,0,{"$f":"IF(ISERROR(VLOOKUP(A190+8860000,'Growth Data'!A:F,6,0)),0,VLOOKUP(A190+8860000,'Growth Data'!A:F,6,0))","v":0},0,"NO",{"$f":"IF(ISERROR(VLOOKUP(A190+8860000,'Growth Data'!A:C,3,0)),\"NO\",VLOOKUP(A190+8860000,'Growth Data'!A:C,3,0))","v":"NO"},0,0,{"$f":"IF(ISERROR(VLOOKUP(A190+8860000,'Growth Data'!A:G,7,0)),0,VLOOKUP(A190+8860000,'Growth Data'!A:G,7,0))","v":0},0]
[5463,"Sandwich Technology School",0,0,0,0,null,0,0,null,0,0,null,0,0,null,0,0,null,0,0,null,0,null,null,0,0,{"$f":"IF(ISERROR(VLOOKUP(A191+8860000,'Growth Data'!A:F,6,0)),0,VLOOKUP(A191+8860000,'Growth Data'!A:F,6,0))","v":0},0,"NO",{"$f":"IF(ISERROR(VLOOKUP(A191+8860000,'Growth Data'!A:C,3,0)),\"NO\",VLOOKUP(A191+8860000,'Growth Data'!A:C,3,0))","v":"NO"},0,0,{"$f":"IF(ISERROR(VLOOKUP(A191+8860000,'Growth Data'!A:G,7,0)),0,VLOOKUP(A191+8860000,'Growth Data'!A:G,7,0))","v":0},0]
[5464,"Bennett Memorial Diocesan School",0,0,0,0,null,0,0,null,0,0,null,0,0,null,0,0,null,0,0,null,0,null,null,0,0,{"$f":"IF(ISERROR(VLOOKUP(A192+8860000,'Growth Data'!A:F,6,0)),0,VLOOKUP(A192+8860000,'Growth Data'!A:F,6,0))","v":0},0,"NO",{"$f":"IF(ISERROR(VLOOKUP(A192+8860000,'Growth Data'!A:C,3,0)),\"NO\",VLOOKUP(A192+8860000,'Growth Data'!A:C,3,0))","v":"NO"},0,0,{"$f":"IF(ISERROR(VLOOKUP(A192+8860000,'Growth Data'!A:G,7,0)),0,VLOOKUP(A192+8860000,'Growth Data'!A:G,7,0))","v":0},0]
[5465,"Gravesend Grammar School",0,0,{"$f":"C193-D193","v":0},0,null,{"$f":"ROUND(F193-G193,2)","v":0},1,null,{"$f":"ROUND(I193-J193,2)","v":1},1,null,{"$f":"ROUND(L193-M193,2)","v":1},1,null,{"$f":"ROUND(O193-P193,2)","v":1},1,null,{"$f":"ROUND(R193-S193,2)","v":1},1,null,{"$f":"ROUND(U193-V193,2)","v":1},null,null,{"$f":"X193-Y193","v":0},0,{"$f":"IF(ISERROR(VLOOKUP(A193+8860000,'Growth Data'!A:F,6,0)),0,VLOOKUP(A193+8860000,'Growth Data'!A:F,6,0))","v":0},{"$f":"IF(AD193=\"YES\",AA193-AB193,0)","v":0},"NO",{"$f":"IF(ISERROR(VLOOKUP(A193+8860000,'Growth Data'!A:C,3,0)),\"NO\",VLOOKUP(A193+8860000,'Growth Data'!A:C,3,0))","v":"NO"},{"$f":"IF(AD193=AE193,0,1)","v":0},0,{"$f":"IF(ISERROR(VLOOKUP(A193+8860000,'Growth Data'!A:G,7,0)),0,VLOOKUP(A193+8860000,'Growth Data'!A:G,7,0))","v":0},0]
[5466,"Brockhill Park Performing Arts College",0,0,0,0,null,0,2,null,2,2,null,2,2,null,2,2,null,2,2,null,2,null,null,0,0,{"$f":"IF(ISERROR(VLOOKUP(A194+8860000,'Growth Data'!A:F,6,0)),0,VLOOKUP(A194+8860000,'Growth Data'!A:F,6,0))","v":0},0,"NO",{"$f":"IF(ISERROR(VLOOKUP(A194+8860000,'Growth Data'!A:C,3,0)),\"NO\",VLOOKUP(A194+8860000,'Growth Data'!A:C,3,0))","v":"NO"},0,0,{"$f":"IF(ISERROR(VLOOKUP(A194+8860000,'Growth Data'!A:G,7,0)),0,VLOOKUP(A194+8860000,'Growth Data'!A:G,7,0))","v":0},0]
[5467,"Mayfield Grammar School, Gravesend",0,0,0,0,null,0,3,null,3,3,null,3,3,null,3,3,null,3,3,null,3,null,null,0,0,{"$f":"IF(ISERROR(VLOOKUP(A195+8860000,'Growth Data'!A:F,6,0)),0,VLOOKUP(A195+8860000,'Growth Data'!A:F,6,0))","v":145},0,"NO",{"$f":"IF(ISERROR(VLOOKUP(A195+8860000,'Growth Data'!A:C,3,0)),\"NO\",VLOOKUP(A195+8860000,'Growth Data'!A:C,3,0))","v":"YES"},1,0,{"$f":"IF(ISERROR(VLOOKUP(A195+8860000,'Growth Data'!A:G,7,0)),0,VLOOKUP(A195+8860000,'Growth Data'!A:G,7,0))","v":180},{"$f":"IF(AG195=AH195,0,1)","v":1}]
[6905,"Knole Academy",0,0,0,0,null,0,4,null,4,4,null,4,4,null,4,4,null,4,4,null,4,null,null,0,0,{"$f":"IF(ISERROR(VLOOKUP(A196+8860000,'Growth Data'!A:F,6,0)),0,VLOOKUP(A196+8860000,'Growth Data'!A:F,6,0))","v":0},0,"NO",{"$f":"IF(ISERROR(VLOOKUP(A196+8860000,'Growth Data'!A:C,3,0)),\"NO\",VLOOKUP(A196+8860000,'Growth Data'!A:C,3,0))","v":"NO"},0,0,{"$f":"IF(ISERROR(VLOOKUP(A196+8860000,'Growth Data'!A:G,7,0)),0,VLOOKUP(A196+8860000,'Growth Data'!A:G,7,0))","v":0},0]
[6908,"Folkestone Academy",0,0,0,0,null,0,5,null,5,5,null,5,5,null,5,5,null,5,5,null,5,null,null,0,0,{"$f":"IF(ISERROR(VLOOKUP(A197+8860000,'Growth Data'!A:F,6,0)),0,VLOOKUP(A197+8860000,'Growth Data'!A:F,6,0))","v":0},0,"NO",{"$f":"IF(ISERROR(VLOOKUP(A197+8860000,'Growth Data'!A:C,3,0)),\"NO\",VLOOKUP(A197+8860000,'Growth Data'!A:C,3,0))","v":"NO"},0,0,{"$f":"IF(ISERROR(VLOOKUP(A197+8860000,'Growth Data'!A:G,7,0)),0,VLOOKUP(A197+8860000,'Growth Data'!A:G,7,0))","v":0},0]
[6909,"Marsh Academy",0,0,0,0,null,0,6,null,6,6,null,6,6,null,6,6,null,6,6,null,6,null,null,0,0,{"$f":"IF(ISERROR(VLOOKUP(A198+8860000,'Growth Data'!A:F,6,0)),0,VLOOKUP(A198+8860000,'Growth Data'!A:F,6,0))","v":0},0,"NO",{"$f":"IF(ISERROR(VLOOKUP(A198+8860000,'Growth Data'!A:C,3,0)),\"NO\",VLOOKUP(A198+8860000,'Growth Data'!A:C,3,0))","v":"NO"},0,0,{"$f":"IF(ISERROR(VLOOKUP(A198+8860000,'Growth Data'!A:G,7,0)),0,VLOOKUP(A198+8860000,'Growth Data'!A:G,7,0))","v":0},0]
[6910,"Leigh Academy, The",0,0,0,0,null,0,7,null,7,7,null,7,7,null,7,7,null,7,7,null,7,null,null,0,0,{"$f":"IF(ISERROR(VLOOKUP(A199+8860000,'Growth Data'!A:F,6,0)),0,VLOOKUP(A199+8860000,'Growth Data'!A:F,6,0))","v":0},0,"NO",{"$f":"IF(ISERROR(VLOOKUP(A199+8860000,'Growth Data'!A:C,3,0)),\"NO\",VLOOKUP(A199+8860000,'Growth Data'!A:C,3,0))","v":"NO"},0,0,{"$f":"IF(ISERROR(VLOOKUP(A199+8860000,'Growth Data'!A:G,7,0)),0,VLOOKUP(A199+8860000,'Growth Data'!A:G,7,0))","v":0},0]
[6911,"Spires Academy",0,0,0,0,null,0,8,null,8,8,null,8,8,null,8,8,null,8,8,null,8,null,null,0,0,{"$f":"IF(ISERROR(VLOOKUP(A200+8860000,'Growth Data'!A:F,6,0)),0,VLOOKUP(A200+8860000,'Growth Data'!A:F,6,0))","v":120},0,"NO",{"$f":"IF(ISERROR(VLOOKUP(A200+8860000,'Growth Data'!A:C,3,0)),\"NO\",VLOOKUP(A200+8860000,'Growth Data'!A:C,3,0))","v":"YES"},1,0,{"$f":"IF(ISERROR(VLOOKUP(A200+8860000,'Growth Data'!A:G,7,0)),0,VLOOKUP(A200+8860000,'Growth Data'!A:G,7,0))","v":150},1]
[6912,"New Line Learning Academy",0,0,0,0,null,0,9,null,9,9,null,9,9,null,9,9,null,9,9,null,9,null,null,0,0,{"$f":"IF(ISERROR(VLOOKUP(A201+8860000,'Growth Data'!A:F,6,0)),0,VLOOKUP(A201+8860000,'Growth Data'!A:F,6,0))","v":0},0,"NO",{"$f":"IF(ISERROR(VLOOKUP(A201+8860000,'Growth Data'!A:C,3,0)),\"NO\",VLOOKUP(A201+8860000,'Growth Data'!A:C,3,0))","v":"NO"},0,0,{"$f":"IF(ISERROR(VLOOKUP(A201+8860000,'Growth Data'!A:G,7,0)),0,VLOOKUP(A201+8860000,'Growth Data'!A:G,7,0))","v":0},0]
[6913,"Cornwallis Academy",0,0,0,0,null,0,10,null,10,10,null,10,10,null,10,10,null,10,10,null,10,null,null,0,0,{"$f":"IF(ISERROR(VLOOKUP(A202+8860000,'Growth Data'!A:F,6,0)),0,VLOOKUP(A202+8860000,'Growth Data'!A:F,6,0))","v":0},0,"NO",{"$f":"IF(ISERROR(VLOOKUP(A202+8860000,'Growth Data'!A:C,3,0)),\"NO\",VLOOKUP(A202+8860000,'Growth Data'!A:C,3,0))","v":"NO"},0,0,{"$f":"IF(ISERROR(VLOOKUP(A202+8860000,'Growth Data'!A:G,7,0)),0,VLOOKUP(A202+8860000,'Growth Data'!A:G,7,0))","v":0},0]
[6914,"Longfield Academy",0,0,0,0,null,0,11,null,11,11,null,11,11,null,11,11,null,11,11,null,11,null,null,0,0,{"$f":"IF(ISERROR(VLOOKUP(A203+8860000,'Growth Data'!A:F,6,0)),0,VLOOKUP(A203+8860000,'Growth Data'!A:F,6,0))","v":0},0,"NO",{"$f":"IF(ISERROR(VLOOKUP(A203+8860000,'Growth Data'!A:C,3,0)),\"NO\",VLOOKUP(A203+8860000,'Growth Data'!A:C,3,0))","v":"NO"},0,0,{"$f":"IF(ISERROR(VLOOKUP(A203+8860000,'Growth Data'!A:G,7,0)),0,VLOOKUP(A203+8860000,'Growth Data'!A:G,7,0))","v":0},0]
[6915,"Oasis Academy Isle of Sheppey",0,0,0,0,null,0,12,null,12,12,null,12,12,null,12,12,null,12,12,null,12,null,null,0,0,{"$f":"IF(ISERROR(VLOOKUP(A204+8860000,'Growth Data'!A:F,6,0)),0,VLOOKUP(A204+8860000,'Growth Data'!A:F,6,0))","v":0},0,"NO",{"$f":"IF(ISERROR(VLOOKUP(A204+8860000,'Growth Data'!A:C,3,0)),\"NO\",VLOOKUP(A204+8860000,'Growth Data'!A:C,3,0))","v":"NO"},0,0,{"$f":"IF(ISERROR(VLOOKUP(A204+8860000,'Growth Data'!A:G,7,0)),0,VLOOKUP(A204+8860000,'Growth Data'!A:G,7,0))","v":0},0]
[6916,"Skinners Kent Academy",0,0,0,0,null,0,13,null,13,13,null,13,13,null,13,13,null,13,13,null,13,null,null,0,0,{"$f":"IF(ISERROR(VLOOKUP(A205+8860000,'Growth Data'!A:F,6,0)),0,VLOOKUP(A205+8860000,'Growth Data'!A:F,6,0))","v":0},0,"NO",{"$f":"IF(ISERROR(VLOOKUP(A205+8860000,'Growth Data'!A:C,3,0)),\"NO\",VLOOKUP(A205+8860000,'Growth Data'!A:C,3,0))","v":"NO"},0,0,{"$f":"IF(ISERROR(VLOOKUP(A205+8860000,'Growth Data'!A:G,7,0)),0,VLOOKUP(A205+8860000,'Growth Data'!A:G,7,0))","v":0},0]
[6917,"Dover Christ Church Academy",0,0,0,0,null,0,14,null,14,14,null,14,14,null,14,14,null,14,14,null,14,null,null,0,0,{"$f":"IF(ISERROR(VLOOKUP(A206+8860000,'Growth Data'!A:F,6,0)),0,VLOOKUP(A206+8860000,'Growth Data'!A:F,6,0))","v":0},0,"NO",{"$f":"IF(ISERROR(VLOOKUP(A206+8860000,'Growth Data'!A:C,3,0)),\"NO\",VLOOKUP(A206+8860000,'Growth Data'!A:C,3,0))","v":"NO"},0,0,{"$f":"IF(ISERROR(VLOOKUP(A206+8860000,'Growth Data'!A:G,7,0)),0,VLOOKUP(A206+8860000,'Growth Data'!A:G,7,0))","v":0},0]
[6918,"Duke of York's Royal Military School",0,0,0,0,null,0,15,null,15,15,null,15,15,null,15,15,null,15,15,null,15,null,null,0,0,{"$f":"IF(ISERROR(VLOOKUP(A207+8860000,'Growth Data'!A:F,6,0)),0,VLOOKUP(A207+8860000,'Growth Data'!A:F,6,0))","v":0},0,"NO",{"$f":"IF(ISERROR(VLOOKUP(A207+8860000,'Growth Data'!A:C,3,0)),\"NO\",VLOOKUP(A207+8860000,'Growth Data'!A:C,3,0))","v":"NO"},0,0,{"$f":"IF(ISERROR(VLOOKUP(A207+8860000,'Growth Data'!A:G,7,0)),0,VLOOKUP(A207+8860000,'Growth Data'!A:G,7,0))","v":0},0]
[6919,"John Wallis Church of England Academy, The",5.33,5.33,0,0,null,0,16,null,16,16,null,16,16,null,16,16,null,16,16,null,16,null,null,0,0,{"$f":"IF(ISERROR(VLOOKUP(A208+8860000,'Growth Data'!A:F,6,0)),0,VLOOKUP(A208+8860000,'Growth Data'!A:F,6,0))","v":0},0,"NO",{"$f":"IF(ISERROR(VLOOKUP(A208+8860000,'Growth Data'!A:C,3,0)),\"NO\",VLOOKUP(A208+8860000,'Growth Data'!A:C,3,0))","v":"NO"},0,0,{"$f":"IF(ISERROR(VLOOKUP(A208+8860000,'Growth Data'!A:G,7,0)),0,VLOOKUP(A208+8860000,'Growth Data'!A:G,7,0))","v":0},0]
[6920,"Wilmington Academy",0,0,0,0,null,0,17,null,17,17,null,17,17,null,17,17,null,17,17,null,17,null,null,0,0,{"$f":"IF(ISERROR(VLOOKUP(A209+8860000,'Growth Data'!A:F,6,0)),0,VLOOKUP(A209+8860000,'Growth Data'!A:F,6,0))","v":192},0,"NO",{"$f":"IF(ISERROR(VLOOKUP(A209+8860000,'Growth Data'!A:C,3,0)),\"NO\",VLOOKUP(A209+8860000,'Growth Data'!A:C,3,0))","v":"YES"},1,0,{"$f":"IF(ISERROR(VLOOKUP(A209+8860000,'Growth Data'!A:G,7,0)),0,VLOOKUP(A209+8860000,'Growth Data'!A:G,7,0))","v":240},1]

{"sheet":"Growth Data","index":1,"n_rows":38,"n_cols":12,"rows_kept":38,"cut":false,"hidden":true,"merged":[[1,5,1,6],[1,7,1,8],[1,9,1,10]]}
[1,2,3,4,5,6,7,8,9,10,11,12]
[null,null,null,null,null,"2019-20",null,"2020-21",null,"2021-22"]
["DfE","School Name","2019-20","2020-21","2021-22","Lower","Higher","Lower","Higher","Lower","Higher"]
[8862024,"Dover Road Community Primary School (Copperfield)","YES","NO","NO",87,90]
[8862028,"Cliftonville Primary School","YES","YES","YES",90,120,90,120,90,120]
[8862034,"Thistle Hill Primary School - Sponsor Lilac Sky","YES","YES","YES",30,60,37,60,41,60]
[8862036,"Leybourne Chase - sponsored Valley park","YES","YES","YES",20,30,20,30,19,30]
[8862037,"Holborough Lakes Primary School -sponsored Invicta Park","YES","YES","YES",15,30,16,30,17,30]
[8862038,"Kings Hill New Primary School - sponsored Invicta Park","YES","YES","YES",15,30,17,30,16,30]
[8862039,"Martello Grove Primary School - Sponsor Lilac Sky","YES","YES","YES",18,30,16,30,27,30]
[8862055,"Lansdowne Primary School","YES","NO","NO",30,60]
[8862061,"Finberry (Cheeseman's Green)","YES","NO","NO",21,30]
[8862073,"Langley Park Primary Academy","YES","YES","YES",0,60,0,60,30,60]
[8862092,"Knockhall Community Primary School","YES","NO","NO",60,90]
[8862099,"Edenbridge Primary School","YES","YES","YES",60,90,60,90,60,90]
[8862180,"South Borough Primary School","YES","YES","YES",31,60,30,60,31,60]
[8862230,"Iwade Community Primary School","YES","YES","NO",63,90,60,90]
[8862249,"Regis Manor School","NO","NO","YES",null,null,null,null,60,90]
[8862315,"White Cliffs Primary College for the Arts","YES","NO","NO",30,60]
[8862438,"Joyden's Wood Junior School","YES","NO","NO",79,90]
[8862654,"Canterbury Primary School, The","YES","YES","YES",40,60,41,60,43,60]
[8862657,"Temple Hill Community Primary and Nursery School","YES","YES","YES",90,120,90,120,96,120]
[8862658,"Westcourt School","YES","YES","YES",30,60,30,60,30,60]
[8862679,"Brent Primary School, The","YES","YES","YES",62,90,64,90,62,90]
[8862684,"Wentworth Primary School","YES","YES","YES",73,90,71,90,70,90]
[8863021,"Stone St Mary's CEP School","YES","NO","NO",63,90]
[8863708,"St John's Catholic Primary School, Gravesend","YES","YES","YES",90,120,90,120,90,120]
[8864002,"Sittingbourne Community College","NO","YES","YES",null,null,210,270,240,270]
[8864006,"Trinity Free School","NO","YES","YES",null,null,122,180,121,180]
[8864046,"Weald of Kent Grammar School Annex","NO","YES","YES",null,null,0,120,0,120]
[8864633,"Ursuline College, Westgate on Sea","NO","NO","YES",null,null,null,null,123,150]
[8865220,"Halfway Houses Primary School","YES","YES","NO",60,90,60,90]
[8865400,"Wilmington Grammar School for Girls","YES","NO","NO",120,150]
[8865403,"Wilmington Grammar School for Boys","YES","NO","NO",148,150]
[8865411,"Dartford Grammar School for Girls","YES","YES","NO",160,180,160,180]
[8865467,"Mayfield Grammar School, Gravesend","YES","NO","NO",145,180]
[8866911,"Spires Academy","YES","YES","NO",120,150,120,150]
[8866920,"Wilmington Academy","YES","YES","NO",192,240,196,240]

{"sheet":"Contents","index":2,"n_rows":8,"n_cols":12,"rows_kept":8,"cut":false,"hidden":false,"merged":[[6,1,6,11],[3,1,3,11],[4,1,4,11],[5,1,5,11],[0,0,1,11],[2,0,2,11]]}
["Contents"]
[]
["Guidance has been written to aid the user in populating this template, to access this guidance click on this link\nUser guidance"]
["Early Years","This is the input sheet to calculate your Early Years 3 & 4 years olds free entitlement, Early Years Pupil Premium and 2 Year old funding, Special Education Needs Inclusion Fund (SENIF) and Disability Access Fund (DAF). Please note that the funding rates are compliant with Dedicated School Grant Financial year that runs from April 2018 to March 2019."]
["High Needs Mainstream","The purpose of this template is to calculate your High Needs mainstream funding for 2018-19. Please note that the funding rates are compliant with Dedicated School Grant Financial year that runs from April 2018 to March 2019."]
["Specialist Resource Provision","The purpose of this template is to calculate your Specialist Resource Provision (SRP) Funding for 2018-19. We have not extended the forecast period in the same way as Early Years and Mainstream High Needs due to complications around place funding. Academies will therefore need to do their own calculations to estimate funding for the period April 2019 to August 2019."]
["Growth Funding ","Funding information will only appear on this template for those Academies entitled to Rising Roll funding. Academies entitled to re-organisation funding will be notified by email."]
[null,null,null,null,null,null,null,null,null,null,null,"V2"]

{"sheet":"Data","index":3,"n_rows":243,"n_cols":25,"rows_kept":243,"cut":false,"hidden":true,"merged":[]}
[1,2,3,4,5,6,7,8,9,10,11,12,13,14,15,16,17,18,19,20,21,22,23,24,25]
[]
["DfE","School name","Base rate","Qualified Teacher Supplement","Disadvantage supplement","IDACI","Ever6 FSM","Low Cost, high Incidence SEN","English as an additional language","Element of Lump Sum","London Fringe Multiplier","des1pre £","des1post£","des2pre£","des2post£","summerpreplace","summerpostplace","winterpreplace","winterpostplace","Oct 17 Pre-16 Pupils","Oct 18 Pre-16 Pupils",null,null,"Phase","Growth"]
[2001,"Horizon Primary Academy","","","",62403.028400000017,31801.832440191396,35248.473754678198,1193.7609802259901,6235,3.6399999999999988E-2,"","",null,null,null,null,null,null,0,0,null,null,1,0]
[2003,"Oaks Primary Academy",4,0.9,0.01,47604.595950857183,25050.723630329678,44145.732561039775,3057.7750766666641,6235,0,"","",null,null,null,null,null,null,0,0,null,null,1,0]
[2004,"Tree Tops Primary Academy",4,0.9,1.03,79905.096500000043,44347.325443319518,80667.238846980326,13739.424404926083,6235,0,"","",null,null,null,null,null,null,0,0,null,null,1,0]
[2006,"St James the Great Academy",4,0.9,0.22,53877.149599999997,23243.82099216495,49910.590912460779,600.70082197452268,6235,0,"","",null,null,null,null,null,null,0,0,null,null,1,0]
[2007,"Molehill Primary Academy","","","",76662.860899999971,49169.933272058835,85730.65376520167,10948.536405579405,6235,0,1023.2400876057736,1023.2400876057736,null,null,4,0,4,0,0,2,null,null,1,0]
[2008,"Tiger Primary School","","","",66073.52092422056,26352.170460000008,73207.158831660097,13238.010610614518,6235,0,"","",null,null,null,null,null,null,0,0,null,null,1,0]
[2009,"Northdown Primary School",4,0.9,0.61,130319.8587,60841.413813781524,103564.8310212222,14858.785638686139,6235,0,"","",null,null,null,null,null,null,0,0,null,null,1,0]
[2010,"Newlands Primary School","","","",104271.89800000007,62577.634728797973,117919.6057371253,14697.450964076259,6235,0,"","",null,null,null,null,null,null,0,0,null,null,1,0]
[2011,"Salmestone Primary School",4,0.9,0.31,114078.66000000008,38591.660164022353,90874.492991113671,10535.335797857146,6235,0,"","",null,null,null,null,null,null,0,0,null,null,1,0]
[2013,"Hersden Village Primary School","","","",18192.544199999989,10561.934883913047,19257.289265894673,2820.5259020270287,6235,0,"","",null,null,null,null,null,null,0,0,null,null,1,0]
[2014,"St Laurence in Thanet C of E Junior Academy","","","",58165.106249999946,34367.697360000006,50829.810457701373,2061.421400000002,6235,0,"","",null,null,null,null,null,null,0,0,null,null,1,0]
[2015,"Dame Janet Primary Academy",4,0.9,0.46,138726.48673438208,83858.297737868881,167990.77616662145,16789.939790680102,6235,0,"","",null,null,null,null,null,null,0,0,null,null,1,0]
[2017,"Drapers Mills Primary Academy",4,0.9,0.61,208573.81670000008,88959.934624864894,182717.08081187509,58713.610948926027,6235,0,"","",null,null,null,null,null,null,0,0,null,null,1,0]
[2018,"Temple Grove Academy",4,0.9,0.25,32622.493999999984,30006.280015230135,50003.486266303407,14544.178047680381,6235,0,"","",null,null,null,null,null,null,0,0,null,null,1,0]
[2019,"Chantry Community Academy",4,0.9,0.28000000000000003,91082.803799999921,38438.504280000016,134554.87487371356,72325.189119148854,6235,0,"","",null,null,null,null,null,null,0,0,null,null,1,20616.64067325]
[2020,"Christ Church CEJ School, Ramsgate","","","",51815.728199999983,25777.774400000002,46035.9440363139,5153.5534999999982,6235,0,"","",null,null,null,null,null,null,0,0,null,null,1,0]
[2021,"Kemsley Primary Academy",4,0.9,0,34593.853299999988,17984.419650426546,49676.286350054936,5415.5497952514024,6235,0,"","",null,null,null,null,null,null,0,0,null,null,1,0]
[2022,"Milton Court Primary Academy",4,0.9,7.0000000000000007E-2,42694.438849999962,30152.791080000003,64111.655667082174,6934.9552300578061,6235,0,"","",null,null,null,null,null,null,0,0,null,null,1,0]
[2023,"Temple Ewell CEP School","","","",14530.018799999969,9995.0297462068993,14991.812864467151,1209.2590102362212,6235,0,"","",null,null,null,null,null,null,0,0,null,null,1,0]
[2024,"Copperfield Academy",4,0.9,0.1,79865.068899999955,47203.135941176486,138815.70187408096,72198.36742924522,6235,0,"","",null,null,null,null,null,null,0,0,null,null,1,10308.320336625]
[2025,"Wells Free School, The","","","",990.68310000000054,7220.438790184051,32488.781289678518,18695.337696808529,6235,0,"","",null,null,null,null,null,null,0,0,null,null,1,0]
[2026,"Petham Primary School","","","",4152.8634999999958,2850.5992205940602,18875.713426978553,657.52234310344727,6235,0,"","",null,null,null,null,null,null,0,0,null,null,1,0]
[2027,"Archbishop Courtenay Primary School",4,0.9,0,43922.160393749939,33238.391649324331,90042.001286777042,44430.99338928565,6235,0,"","",null,null,null,null,null,null,0,0,null,null,1,0]
[2028,"Cliftonville Primary School",4,0.9,0.5,285782.0536499999,103499.21070695281,219910.06660081304,65517.496162418312,6235,0,"","",null,null,null,null,null,null,0,0,null,null,1,34361.067788749999]
[2029,"Tymberwood Academy",4,0.9,0.14000000000000001,96056.233099999925,57482.643193984972,89852.086355584877,14338.736463716803,6235,0,1045.0424131871689,1045.0424131871689,null,null,3,0,4,0,0,4,null,null,1,0]
[2030,"Valley Invicta Primary School at Aylesford","","","",38836.778900000012,25077.940854437093,56548.985143297556,8417.4707166666703,6235,0,"","",null,null,null,null,null,null,0,0,null,null,1,0]
[2034,"Thistle Hill Academy","","","",41843.852349999994,36046.031082352951,81816.967635123539,5053.2898132295732,6235,0,300.038683178062,300.038683178062,null,null,4,0,8,0,0,2,null,null,1,41233.281346500029]
[2036,"Valley Invicta Primary School at Leybourne Chase","","","",5173.1072126436738,7538.7645944055957,31216.502913110427,1828.1186402027054,6235,0,387.75798142367586,387.75798142367586,null,null,1,0,4,0,0,1,null,null,1,32070.3299361666]
[2037,"Valley Invicta Primary School at Holborough Lakes","","","",33252.928699999997,12009.50533469388,34598.442412384982,8188.4238944444451,6235,0,301.09131475700934,301.09131475700934,null,null,8,0,5,0,0,5,null,null,1,38942.543493916703]
[2038,"Valley Invicta Primary School at Kings Hill","","","",5723.9467999999979,2918.0120400000023,24314.377181898984,11650.040284306544,6235,0,684.57205434069385,684.57205434069385,null,null,8,0,10,0,0,8,null,null,1,35506.4367150416]
[2039,"Martello Primary","","","",56839.192000000039,25663.046285562919,50928.288480942807,11964.893440559454,6235,0,367.43277817164335,367.43277817164335,null,null,4,0,3,0,0,3,null,null,1,28634.223157291672]
[2041,"Holy Family Catholic Primary School, The","","","",55730.006136842087,27092.931232500006,46122.463201823884,9114.1548009259277,6235,0,"","",null,null,null,null,null,null,0,0,null,null,1,0]
[2043,"Jubilee Primary School","","","",11321.664239700376,12063.453178378382,35304.943561856722,21229.390431306267,6235,0,"","",null,null,null,null,null,null,0,0,null,null,1,0]
[2044,"Loose Primary School","","","",52756.376800000056,18509.000936697252,100076.35845957001,11351.49970044248,6235,0,"","",null,null,null,null,null,null,0,0,null,null,1,0]
[2045,"Skinners' Kent Primary School","","","",11870.089476190486,6095.4029280000013,22436.101775143143,10144.131376495756,6235,0,"","",null,null,null,null,null,null,0,0,null,null,1,0]
[2048,"Reculver C of E Primary School","","","",12528.638800000012,31128.436288073404,106994.82300796565,1187.2743506329123,6235,0,751.03076372550049,751.03076372550049,null,null,null,0,7,0,0,8,null,null,1,24052.747452125001]
[2051,"St Mary of Charity CofE (Aided) Primary School","","","",42559.345700000005,21812.139999000006,58778.035689222168,4821.6297152542429,6235,0,"","",null,null,null,null,null,null,0,0,null,null,1,0]
[2052,"Kennington C of E Academy","","","",39417.179100000008,35857.040087368434,77539.944777997793,6699.6195500000085,6235,0,"","",null,null,null,null,null,null,0,0,null,null,1,0]
[2054,"St Edward's Catholic Primary School","","","",85238.774200000043,24908.189875778899,51615.202181413966,9756.613785227275,6235,0,"","",null,null,null,null,null,null,0,0,null,null,1,0]
[2055,"Lansdowne Primary School","","","",88671.14089999994,37325.154996320482,67380.066770202859,16428.198608709681,6235,0,"","",null,null,null,null,null,null,0,0,null,null,1,45814.757051666704]
[2058,"Charlton CofE Primary School","","","",53226.70109999994,9578.5843614213227,36713.780763041184,10973.298062195161,6235,0,"","",null,null,null,null,null,null,0,0,null,null,1,0]
[2059,"Lydd Primary School",4,0.9,0,44590.746400000004,32667.15129831326,63825.272219987841,1858.1826704225327,6235,0,"","",null,null,null,null,null,null,0,0,null,null,1,0]
[2060,"Beaver Green Primary School",4,0.9,0.46,123320.82871915438,57786.675779852594,103213.92090460508,12390.489565482954,6235,0,"","",null,null,null,null,null,null,0,0,null,null,1,0]
[2061,"Finberry Primary School","","","",8035.540700000005,19056.881188489217,50159.067373525111,7343.8137375000006,6235,0,283.59131475700934,283.59131475700934,null,null,8,0,8,0,0,3,null,null,1,53832.339535708306]
[2063,"Istead Rise Primary School","","","",31992.059299999935,19432.90548325302,62399.308491983771,7261.9963735401534,6235,0,"","",null,null,null,null,null,null,0,0,null,null,1,0]
[2064,"Ramsgate Arts Primary School","","","",62379.402296144901,21427.274625000005,52035.661620372834,6328.3420397849522,6235,0,"","",null,null,null,null,null,null,0,0,null,null,1,0]
[2069,"Dartford Primary Academy",4,0.9,0,51855.75579999997,44519.069368603545,134340.69809018649,42098.508461039004,6235,3.6399999999999988E-2,"","",null,null,null,null,null,null,0,0,null,null,1,0]
[2073,"Langley Park Primary Academy","","","",35923.425042690091,8680.9078519760496,38965.654033470302,22115.81801980397,6235,0,648.35898986476138,648.35898986476138,null,null,8,0,11,0,0,8,null,null,1,0]
[2076,"Cherry Orchard Primary Academy","","","",23979.034124999962,6457.8954983606573,50627.441082458448,19365.672688144296,6235,3.6399999999999988E-2,324.09074959942365,324.09074959942365,null,null,8,0,12,0,0,9,null,null,1,44856.250000000007]
[2077,"Westgate Primary School","","","",45340.843442016834,14713.183070886082,57865.1113086361,28877.160305502366,6235,3.6399999999999988E-2,"","",null,null,null,null,null,null,0,0,null,null,1,0]
[2078,"St Nicholas C of E Primary Academy","","","",45091.091399999968,37306.92028710281,87115.440848278668,1792.3884376271139,6235,0,"","",null,null,null,null,null,null,0,0,null,null,1,0]
[2080,"Barming Primary School","","","",14249.974217326739,19453.413600000007,76894.446401562396,11230.088050564975,6235,0,"","",null,null,null,null,null,null,0,0,null,null,1,0]
[2081,"Brenzett CE Primary School","","","",15430.639799999994,7549.0858746268668,21022.063366128099,0,6235,0,"","",null,null,null,null,null,null,0,0,null,null,1,0]
[2085,"Royal Rise Primary School","","","",18102.482100000005,18904.140745411769,38530.083595610515,11730.152740645168,6235,0,"","",null,null,null,null,null,null,0,0,null,null,1,0]
[2086,"Bishop Chavasse Primary School","","","",9375.2617209621949,11455.899120000002,18859.169344345017,4966.1515545454558,6235,0,"","",null,null,null,null,null,null,0,0,null,null,1,0]
[2087,"Morehall Primary","","","",20188.920749999997,15329.695196250004,39020.94304030417,5034.141894512195,6235,0,1045.0424131871689,1045.0424131871689,null,null,3,0,4,0,0,2,null,null,1,0]
[2090,"Richmond Academy",4,0.9,0.65,162877.30785000016,58515.042499734758,117224.63268484146,11190.573314285712,6235,0,"","",null,null,null,null,null,null,0,0,null,null,1,0]
[2092,"Knockhall Primary School",4,0.9,0,49354.030800000022,44657.319911411054,117052.2388416311,23623.588306569342,6235,3.6399999999999988E-2,"","",null,null,null,null,null,null,0,0,null,null,1,16035.164968083332]
[2093,"Chilmington Green Primary School","","","",11115.998083333354,0,0,0,6235,0,"","",null,null,null,null,null,null,0,0,null,null,1,24000]
[2096,"Riverview Junior School","","","",67396.471499999912,26697.339568935287,92383.194965232047,10822.462350000013,6235,0,"","",null,null,null,null,null,null,0,0,null,null,1,0]
[2098,"Pilgrims' Way Primary School and Nursery",4,0.9,0.1,22915.800999999959,41898.784964210536,86452.041260213184,20312.109139655116,6235,0,"","",null,null,null,null,null,null,0,0,null,null,1,0]
[2099,"Edenbridge Primary School",4,0.9,0.09,29940.644800000016,35772.666120000009,90003.846524504886,3517.1674402061813,6235,3.6399999999999988E-2,"","",null,null,null,null,null,null,0,0,null,null,1,34361.067788749999]
[2107,"Rosherville Church of England Academy","","","",37724.562724637675,12644.718840000003,34248.963196098193,18638.685158333312,6235,0,"","",null,null,null,null,null,null,0,0,null,null,1,0]
[2110,"Culverstone Green Primary School","","","",6124.2227999999959,7744.1340264114851,50315.63563557672,1197.6973497206707,6235,0,"","",null,null,null,null,null,null,0,0,null,null,1,0]
[2141,"Amherst School","","","",0,5187.5769600000012,37736.586554528774,5668.9088499999943,6235,3.6399999999999988E-2,"","",null,null,null,null,null,null,0,0,null,null,1,0]
[2172,"Valley Invicta Primary School at East Borough","","","",26508.278099999981,22595.888104615391,81365.107358369642,40988.453371373944,6235,0,691.76902403766371,691.76902403766371,null,null,0,0,6,0,0,0,null,null,1,0]
[2180,"South Borough Primary School",4,0.9,0.06,71368.385763031896,21353.832418554226,79568.879761467382,56820.358258962224,6235,0,"","",null,null,null,null,null,null,0,0,null,null,1,67576.766651208309]
[2223,"Bobbing Village School","","","",16631.467800000017,5237.2188447846902,33506.473141846989,4806.1869104972375,6235,0,"","",null,null,null,null,null,null,0,0,null,null,1,0]
[2229,"Graveney Primary School","","","",10907.521000000001,3210.1342574257433,12231.772570035107,599.25040697674501,6235,0,"","",null,null,null,null,null,null,0,0,null,null,1,0]
[2230,"Iwade School","","","",21840.059250000017,20923.631088897197,94366.956737129251,4289.5754132353013,6235,0,"","",null,null,null,null,null,null,0,0,null,null,1,34361.067788749999]
[2232,"Luddenham School","","","",22435.469800000032,5009.9871708542723,49858.696214253432,3001.3592826704539,6235,0,"","",null,null,null,null,null,null,0,0,null,null,1,0]
[2233,"Lynsted and Norton School","","","",5804.0020000000022,4707.9962775000013,21883.753107117333,1207.4039628571441,6235,0,"","",null,null,null,null,null,null,0,0,null,null,1,0]
[2235,"Minster in Sheppey Primary School","","","",93124.211400000073,47624.348821980588,95958.671858611429,611.2622873318378,6235,0,"","",null,null,null,null,null,null,0,0,null,null,1,9162.9514103333331]
[2246,"Sheldwich Primary School","","","",8806.0720000000001,3534.4729791928253,33496.443274941761,4218.2789759259213,6235,0,"","",null,null,null,null,null,null,0,0,null,null,1,0]
[2249,"Regis Manor School",4,0.9,0.19,86349.54009999994,40037.291912832938,84648.196015641006,11822.427418323858,6235,0,"","",null,null,null,null,null,null,0,0,null,null,1,34361.067788749999]
[2264,"Hampton Primary School",4,0.9,0,65925.457199999946,64976.236651698127,115414.58171268762,9537.7032380281562,6235,0,"","",null,null,null,null,null,null,0,0,null,null,1,0]
[2286,"Hamstreet Primary Academy","","","",11465.972732666658,10041.547684630228,60970.004281694084,6059.4515761718758,6235,0,"","",null,null,null,null,null,null,0,0,null,null,1,0]
[2288,"Smarden Primary School","","","",0,2527.8447050847462,19341.490376368005,592.65865250000013,6235,0,"","",null,null,null,null,null,null,0,0,null,null,1,0]
[2290,"Tenterden Infant School","","","",640.44160000000147,4863.3534000000163,26311.901883986582,4001.5827176470589,6235,0,"","",null,null,null,null,null,null,0,0,null,null,1,0]
[2307,"Warden House Primary School","","","",92063.479999999952,44016.649188597294,95659.675947983676,1194.3155730158728,6235,0,"","",null,null,null,null,null,null,0,0,null,null,1,0]
[2309,"Priory Fields School","","","",136714.26779999997,64027.965627480931,84101.57831094951,33989.893998285777,6235,0,"","",null,null,null,null,null,null,0,0,null,null,1,0]
[2310,"Barton Junior School","","","",68086.947599999985,32558.871183157902,40984.194843442354,2576.776750000005,6235,0,"","",null,null,null,null,null,null,0,0,null,null,1,0]
[2313,"St Martin's School","","","",30370.941500000052,9769.9366080000018,42329.577950177605,1188.4725418367395,6235,0,"","",null,null,null,null,null,null,0,0,null,null,1,0]
[2315,"White Cliffs Primary College for the Arts","","","",115814.40229090916,49915.534578233222,56694.265862112617,16514.275882222271,6235,0,"","",null,null,null,null,null,null,0,0,null,null,1,34361.067788749999]
[2316,"Shatterlocks Infant School",4,0.9,0.38,55518.281199999998,19017.323431578952,29760.23931718626,7892.8296846846861,6235,0,"","",null,null,null,null,null,null,0,0,null,null,1,0]
[2435,"South Avenue Primary School","","","",92228.593849999947,45385.048307277124,61513.549206647571,16699.829543820222,6235,0,"","",null,null,null,null,null,null,0,0,null,null,1,0]
[2438,"Joydens Wood Junior School","","","",8936.1616999999897,9351.7012366265062,64455.159264819325,8761.0409500000023,6235,3.6399999999999988E-2,"","",null,null,null,null,null,null,0,0,null,null,1,19471.271746958333]
[2462,"Riverview Infant School","","","",52446.162899999952,14268.689046686221,78637.422075251845,25133.137767685675,6235,0,"","",null,null,null,null,null,null,0,0,null,null,1,0]
[2463,"Minterne Community Junior School","","","",31756.897149999953,22313.915548380468,86697.262965691247,3092.1321000000012,6235,0,214.14687031256486,214.14687031256486,null,null,24,0,24,0,0,30,null,null,1,0]
[2500,"Joydens Wood Infant School","","","",11764.765477290843,1945.3413599999999,28452.984809066256,28232.510478260861,6235,3.6399999999999988E-2,"","",null,null,null,null,null,null,0,0,null,null,1,0]
[2511,"Hartley Primary Academy","","","",25157.346599999986,12798.174165728158,45082.224885321251,9029.5454180672314,6235,3.6399999999999988E-2,"","",null,null,null,null,null,null,0,0,null,null,1,0]
[2513,"Oaks Community Infant School, The",4,0.9,0,27999.306200000028,7457.1418800000029,56000.245722812819,8318.5075516304387,6235,0,332.97384465424574,332.97384465424574,null,null,12,0,12,0,0,7,null,null,1,0]
[2523,"Upton Junior School","","","",36206.328777272785,27979.803390638303,127111.66886289249,7214.9748999999892,6235,0,"","",null,null,null,null,null,null,0,0,null,null,1,0]
[2531,"Vale View Community School",4,0.9,0.28000000000000003,62373.007700000002,26910.555480000006,52155.007405115808,8446.7998829268327,6235,0,"","",null,null,null,null,null,null,0,0,null,null,1,0]
[2595,"Grove Park Primary School","","","",44675.805050000017,19407.205966745849,99293.212627343557,12626.206074999995,6235,0,"","",null,null,null,null,null,null,0,0,null,null,1,0]
[2596,"Chilton Primary School","","","",48203.237299999964,22805.290017391311,71381.179148986572,5419.9169393258444,6235,0,"","",null,null,null,null,null,null,0,0,null,null,1,0]
[2608,"St Stephen's Junior School","","","",88661.13400000002,34288.39087769785,74430.817654512735,25312.680436754177,6235,0,"","",null,null,null,null,null,null,0,0,null,null,1,0]
[2625,"Godinton Primary Academy","","","",20113.869000000021,12938.282961702131,83988.740738518827,6608.5070019336999,6235,0,"","",null,null,null,null,null,null,0,0,null,null,1,0]
[2650,"Dymchurch Primary School","","","",26438.229800000001,18855.363924559591,38582.505478053557,3743.1072789473669,6235,0,"","",null,null,null,null,null,null,0,0,null,null,1,0]
[2654,"Canterbury Primary School, The","","","",74371.280800000008,44525.074611686759,65149.534250115525,25560.947260855246,6235,0,681.35235737099708,681.35235737099708,null,null,12,0,12,0,0,13,null,null,1,29779.592083583397]
[2656,"Meopham Community Academy","","","",9862.3223519721651,12320.495280000003,90425.616243356839,1789.9641701871656,6235,0,"","",null,null,null,null,null,null,0,0,null,null,1,0]
[2657,"Temple Hill Primary Academy",4,0.9,0.2,191928.35313847227,83299.425704619731,168659.64905623227,62957.247756976802,6235,3.6399999999999988E-2,346.09131475700923,346.09131475700923,null,null,4,0,4,0,0,4,null,null,1,66431.397724916664]
[2658,"Westcourt Primary & Nursery School",4,0.9,0.27,76531.351781560268,35726.842523520012,47948.548474537631,31874.155780444478,6235,0,"","",null,null,null,null,null,null,0,0,null,null,1,40361.067788749999]
[2666,"Wrotham Road Primary School",4,0.9,0.19,65745.332999999999,24460.690629073175,103359.6431475174,67895.833163005795,6235,0,"","",null,null,null,null,null,null,0,0,null,null,1,0]
[2676,"West Hill Primary Academy","","","",20250.228732495514,15731.890998260873,111607.31265426271,58106.58135958761,6235,3.6399999999999988E-2,"","",null,null,null,null,null,null,0,0,null,null,1,20616.64067325]
[2677,"Coxheath Primary School","","","",34113.522099999966,28047.621204507046,96589.957086599141,11071.827841935492,6235,0,"","",null,null,null,null,null,null,0,0,null,null,1,0]
[2679,"Brent Primary School, The","","","",35424.426000000043,41383.442483778243,99995.610317328435,21830.35629789719,6235,3.6399999999999988E-2,"","",null,null,null,null,null,null,0,0,null,null,1,40361.067788749999]
[2684,"Wentworth Primary School","","","",40197.717300000018,24429.566089180335,111807.3257593779,22678.924902234059,6235,3.6399999999999988E-2,"","",null,null,null,null,null,null,0,0,null,null,1,22907.378525833334]
[2685,"Gateway Primary Academy, The","","","",5710.9854819047587,4840.4130537735855,47848.220452333902,20314.061982967058,6235,3.6399999999999988E-2,"","",null,null,null,null,null,null,0,0,null,null,1,0]
[2686,"Furley Park Primary Academy","","","",28203.354942528735,26454.650678907859,110880.64768759297,35638.349796271526,6235,0,"","",null,null,null,null,null,null,0,0,null,null,1,28634.223157291664]
[3019,"Shorne Church of England (V.C) Primary School","","","",11247.7556,3048.6692955223889,41630.20526422291,601.24790833333384,6235,0,"","",null,null,null,null,null,null,0,0,null,null,1,0]
[3021,"Stone St Mary's CEP School","","","",34258.622149999966,31220.688260139868,126407.67887586437,31479.210476775439,6235,3.6399999999999988E-2,"","",null,null,null,null,null,null,0,0,null,null,1,32070.329936166665]
[3025,"Chiddingstone CEP School","","","",2667.3464463768123,3600.9177026086968,14986.030324598165,0,6235,3.6399999999999988E-2,"","",null,null,null,null,null,null,0,0,null,null,1,0]
[3059,"St Mark's CEP School, Eccles","","","",12828.845800000003,6637.647685039371,37986.449259164496,603.56932882882904,6235,0,"","",null,null,null,null,null,null,0,0,null,null,1,0]
[3086,"West Malling CEP School","","","",23416.146000000004,14371.946168727274,54963.20413535324,2312.2822052910096,6235,0,248.86909253478703,248.86909253478703,null,null,18,0,18,0,0,18,null,null,1,0]
[3110,"Milstead and Frinsted CEP School","","","",8665.9753999999975,6614.1606240000019,26420.628751275759,604.2097206896542,6235,0,"","",null,null,null,null,null,null,0,0,null,null,1,0]
[3112,"Selling CEP School","","","",5703.9329999999918,5583.6554711351364,31385.579120643102,1743.0171391719773,6235,0,"","",null,null,null,null,null,null,0,0,null,null,1,0]
[3119,"Adisham CEP School","","","",15110.419000000011,5511.8005200000016,12010.161631707369,633.82784425287252,6235,0,"","",null,null,null,null,null,null,0,0,null,null,1,0]
[3128,"Sturry CEP School","","","",52105.928300000014,31594.689826733676,52063.666246313587,3026.2145552325514,6235,0,"","",null,null,null,null,null,null,0,0,null,null,1,0]
[3140,"Kingsnorth CEP School","","","",15878.729198090705,13105.938270422539,58504.60285339164,7837.995016713091,6235,0,"","",null,null,null,null,null,null,0,0,null,null,1,0]
[3142,"Pluckley CEP School","","","",1651.1384999999996,3684.0977968141597,14781.737392870627,1817.9018390109911,6235,0,"","",null,null,null,null,null,null,0,0,null,null,1,0]
[3143,"St Michael's CEP School","","","",201.59886131386858,8371.2431427096799,27851.746141969888,2312.8142536585347,6235,0,"","",null,null,null,null,null,null,0,0,null,null,1,0]
[3144,"Tenterden CEJ School","","","",844.17182051281941,12919.604032173916,45224.940448943016,5668.9088500000034,6235,0,"","",null,null,null,null,null,null,0,0,null,null,1,0]
[3148,"Christ Church CEP Academy, Folkestone","","","",159469.95839999986,58300.864919132546,96446.453752220419,30869.928222714723,6235,0,"","",null,null,null,null,null,null,0,0,null,null,1,0]
[3306,"Brenchley & Matfield CEP School","","","",362.34286744186034,4419.2653723636367,34627.036166444806,1238.2843826388901,6235,0,"","",null,null,null,null,null,null,0,0,null,null,1,0]
[3313,"Fordcombe CEP School","","","",680.46920000000011,3566.4591599999981,21703.937913903734,581.27289476744261,6235,3.6399999999999988E-2,"","",null,null,null,null,null,null,0,0,null,null,1,0]
[3324,"Leybourne, St Peter & St Paul CEP School","","","",840.57959999999866,3566.4591600000008,32745.417219511943,1805.1832650837937,6235,0,"","",null,null,null,null,null,null,0,0,null,null,1,0]
[3329,"Borden CEP School","","","",7495.1681000000226,2962.2243436363638,9489.2804043324777,1785.9728508620663,6235,0,"","",null,null,null,null,null,null,0,0,null,null,1,0]
[3330,"Bredgar CEP School","","","",4488.5318446601941,954.48991962616833,12843.361198536864,0,6235,0,"","",null,null,null,null,null,null,0,0,null,null,1,0]
[3343,"Charing CEP School","","","",480.33119999999906,11536.463762181822,24911.11681820103,564.69788351063698,6235,0,"","",null,null,null,null,null,null,0,0,null,null,1,0]
[3348,"St Eanswythe's CEP School","","","",65149.922450000027,15348.564858715601,47868.83579936203,8983.8973175675692,6235,0,"","",null,null,null,null,null,null,0,0,null,null,1,0]
[3349,"Folkestone St Mary's CEP Academy",4,0.9,0.28999999999999998,137744.97850000003,39188.760730434791,95582.365379794457,3652.7452852691226,6235,0,"","",null,null,null,null,null,null,0,0,null,null,1,0]
[3372,"St John's CEP School, Maidstone","","","",6559.5574565517281,4850.6387505882367,47081.992379657757,10756.672305319147,6235,0,"","",null,null,null,null,null,null,0,0,null,null,1,34361.067788749999]
[3708,"St John's Catholic Primary School, Gravesend",4,0.9,0.11,117120.75760000007,25109.313480000004,143588.13442213822,75783.755593224603,6235,0,"","",null,null,null,null,null,null,0,0,null,null,1,39215.698862458303]
[3714,"St Peter's Catholic Primary School, Sittingbourne","","","",22745.683700000001,5138.6375547169828,34346.817376658539,9619.966533333336,6235,0,"","",null,null,null,null,null,null,0,0,null,null,1,0]
[3715,"St Mary's Catholic Primary School, Whitstable","","","",13967.886724570024,11153.896489345798,54347.912051428859,7527.8692196428547,6235,0,"","",null,null,null,null,null,null,0,0,null,null,1,0]
[3716,"St Teresa's Catholic Primary School","","","",18076.482864485984,6840.5110906542077,35366.69413784286,16171.015171621631,6235,0,"","",null,null,null,null,null,null,0,0,null,null,1,0]
[3719,"St Joseph's Catholic Primary School, Aylesham","","","",29680.465400000005,14860.246500000001,18966.119265897112,1737.152865168538,6235,0,"","",null,null,null,null,null,null,0,0,null,null,1,0]
[3720,"St Mary's Catholic School, Deal","","","",32502.41120000001,10425.518744854371,40511.630751956247,4876.7340548571419,6235,0,"","",null,null,null,null,null,null,0,0,null,null,1,0]
[3740,"St Richard's Catholic Primary School, Dover","","","",59956.640063432889,15053.975825744683,44786.297578210615,19463.653218604653,6235,0,"","",null,null,null,null,null,null,0,0,null,null,1,0]
[3743,"St Simon of England RCP School, Ashford","","","",52956.514800000063,13617.389520000002,67133.341359816885,28081.203329395579,6235,0,"","",null,null,null,null,null,null,0,0,null,null,1,0]
[3744,"St Margaret Clitherow Catholic Primary School","","","",22285.366299999998,4182.483924000001,65949.32486289824,33240.420075000067,6235,0,"","",null,null,null,null,null,null,0,0,null,null,1,0]
[3745,"More Park RCP School","","","",17311.936999999984,4910.5704233009719,30530.504334807571,7226.5559191011298,6235,0,"","",null,null,null,null,null,null,0,0,null,null,1,0]
[3751,"St Thomas' Catholic Primary School, Sevenoaks","","","",200.13800000000023,2876.3261537142866,49123.38459443795,10848.666859322006,6235,3.6399999999999988E-2,"","",null,null,null,null,null,null,0,0,null,null,1,0]
[3754,"St Augustine's Catholic Primary School","","","",17762.247500000009,8375.25066640777,61447.977474558124,42347.266380669185,6235,0,"","",null,null,null,null,null,null,0,0,null,null,1,0]
[3889,"St Gregory's Catholic Primary School, Margate",4,0.9,0.04,76382.667700000107,17544.218785540543,67322.260979060127,7981.9210507874068,6235,0,"","",null,null,null,null,null,null,0,0,null,null,1,0]
[3890,"St Joseph's Catholic Primary School, Broadstairs","","","",35039.160349999998,13224.580206923081,35430.598583995983,7777.7192477011477,6235,0,"","",null,null,null,null,null,null,0,0,null,null,1,0]
[3900,"Whitehill Primary School",4,0.9,0.01,123739.93947098276,60168.507924805002,150972.41038424589,29961.43671338155,6235,0,"","",null,null,null,null,null,null,0,0,null,null,1,0]
[3912,"Westlands Primary School","","","",79337.89201848596,50152.201976208191,101193.48089041545,12487.456557692314,6235,0,"","",null,null,null,null,null,null,0,0,null,null,1,50396.232756833298]
[3914,"Oakfield Primary Academy",4,0.9,0,95555.888099999866,49022.602272000011,121328.25046675245,51285.219544285857,6235,3.6399999999999988E-2,639.41030366423684,639.41030366423684,null,null,14,0,14,0,0,14,null,null,1,0]
[3915,"Manor Community Primary School",4,0.9,0.02,140150.36507232001,52356.942144458604,133553.88887515067,32502.000469029721,6235,3.6399999999999988E-2,"","",null,null,null,null,null,null,0,0,null,null,1,0]
[4000,"St Augustine Academy","","","",90647.503650000028,115358.84541299524,251137.2637133869,23662.367277682362,5580,0,661.90274132074421,661.90274132074421,null,null,10,0,12,0,0,14,null,null,2,0]
[4001,"Ebbsfleet Academy, The","","","",134837.97404999979,89622.095113432821,168008.28368325089,55438.225999999988,5580,3.6399999999999988E-2,"","",null,null,null,null,null,null,0,0,null,null,2,0]
[4002,"Sittingbourne Community College","","","",413684.48647114093,239508.22152125553,412764.29979534319,19420.020076929613,5580,0,239.09977710370717,239.09977710370717,844.47024633593253,844.47024633593253,46,0,55,0,0,68,null,null,2,96632.880712500017]
[4003,"High Weald Academy, The","","","",7039.8541499999938,29955.50469660839,114231.56515015654,1391.5441808467745,5580,0,"","",null,null,null,null,null,null,0,0,null,null,2,0]
[4004,"Meopham School","","","",75917.119420454648,73559.429342083313,215753.75156157408,6929.7782499999994,5580,0,679.26902403766371,679.26902403766371,null,null,15,0,15,0,0,16,null,null,2,0]
[4006,"Trinity School","","","",4912.0030786509096,52561.036901669213,157855.81929256857,2771.9112999999988,5580,3.6399999999999988E-2,"","",null,null,null,null,null,null,0,0,null,null,2,108632.8807125]
[4007,"Wye School","","","",26002.652296895776,38563.519996784133,131538.18995812687,6929.7782500000103,5580,0,"","",null,null,null,null,null,null,0,0,null,null,2,12000]
[4009,"Hadlow Rural Community School","","","",30801.739938718703,46877.728735135126,143969.34367649129,0,5580,0,"","",null,null,null,null,null,null,0,0,null,null,2,0]
[4012,"Leigh UTC, The","","","",84717.370865335179,63970.777433729505,111733.10233462547,4412.2045559840435,5580,3.6399999999999988E-2,"","",null,null,null,null,null,null,0,0,null,null,2,32210.960237500007]
[4013,"St Edmund's Catholic School","","","",179406.87021890134,79058.01902748899,170866.11649361707,22175.290399999991,5580,0,"","",null,null,null,null,null,null,0,0,null,null,2,0]
[4015,"Lenham School, The","","","",23765.865219206677,64714.017231627899,191520.42455282979,1391.7546276150622,5580,0,"","",null,null,null,null,null,null,0,0,null,null,2,0]
[4016,"Charles Dickens School, The","","","",337735.37904355925,200328.32478193549,331741.19064150791,16693.294817843835,5580,0,1023.2400876057736,1023.2400876057736,null,null,4,0,4,0,0,6,null,null,2,0]
[4020,"Folkestone Academy","","","",525579.29154729831,298161.46530313429,497214.91178241424,42050.093042803055,5580,0,"","",null,null,null,null,null,null,0,0,null,null,4,0]
[4021,"Turner Free School","","","",39990.908033333326,23880.466160000025,36914.018231933471,4388.8595583333426,5580,0,"","",null,null,null,null,null,null,0,0,null,null,2,0]
[4023,"Goodwin Academy","","","",141954.87976152048,112544.96563847367,220070.24593417448,8341.8429546310799,5580,0,"","",null,null,null,null,null,null,0,14,null,null,2,0]
[4031,"Orchards Academy","","","",143672.17828832709,96596.272801135448,173210.35262221706,8315.7338999999938,5580,3.6399999999999988E-2,691.76902403766371,691.76902403766371,null,null,0,0,6,0,0,0,null,null,2,0]
[4046,"Weald of Kent Grammar School","","","",24617.302633825915,20947.777333333335,11267.14299383967,5557.488555464266,5580,0,"","",null,null,null,null,null,null,0,0,null,null,2,193265.76142500003]
[4058,"Invicta Grammar School","","","",82032.17313651205,38469.545683799995,7633.4625886544227,19453.43080877043,5580,0,"","",null,null,null,null,null,null,0,0,null,null,2,77306.304570000022]
[4080,"Highsted Grammar School","","","",103198.05221139929,29876.468411794449,10639.789543378023,0,5580,0,"","",null,null,null,null,null,null,0,0,null,null,2,0]
[4091,"Whitstable School, The","","","",90692.534699999844,105893.53364978134,165006.97413276802,6929.7782499999994,5580,0,"","",null,null,null,null,null,null,0,0,null,null,2,0]
[4092,"Highworth Grammar School","","","",78374.80313857281,43898.007783764937,10886.045416518138,16631.467800000035,5580,0,"","",null,null,null,null,null,null,0,0,null,null,2,6000]
[4101,"Harvey Grammar School, The","","","",124565.89120000004,47346.116650276679,14286.317260661906,2775.478753410549,5580,0,"","",null,null,null,null,null,null,0,0,null,null,2,0]
[4113,"Astor College","","","",278066.73374999996,160438.77044111412,212119.84135810757,25156.256462849189,5580,0,"","",null,null,null,null,null,null,0,0,null,null,2,0]
[4120,"King Ethelbert School","","","",127953.22684999995,110290.04766,205346.4136591547,4157.8669500000005,5580,0,"","",null,null,null,null,null,null,0,0,null,null,2,0]
[4172,"Hartsdown Academy","","","",347164.37824999978,188912.82464278163,304621.81749689276,42964.625150000051,5580,0,736.74903451472471,736.74903451472471,null,null,4,0,4,0,0,2,null,null,2,0]
[4196,"Towers School and Sixth Form Centre, The","","","",157378.51630000016,152138.89276378861,319497.52712882101,22245.762721186464,5580,0,"","",null,null,null,null,null,null,0,0,null,null,2,6000]
[4242,"Abbey School, The","","","",228032.23374999958,168108.49711858551,290776.671290542,12473.600850000006,5580,0,623.84916286913915,623.84916286913915,null,null,30,0,30,0,0,33,null,null,2,0]
[4249,"Valley Park School","","","",96081.250350000002,91678.669836482746,338954.37942376611,13859.556499999993,5580,0,"","",null,null,null,null,null,null,0,0,null,null,2,48316.440356250008]
[4527,"Borden Grammar School","","","",100149.05520000006,29743.973476071427,8533.7867460579182,0,5580,0,"","",null,null,null,null,null,null,0,0,null,null,2,0]
[4528,"Norton Knatchbull School, The","","","",67645.76523819979,38638.057607191011,15079.569499973903,15245.512149999964,5580,0,"","",null,null,null,null,null,null,0,0,null,null,2,6000]
[4633,"Ursuline College","","","",196110.22275000013,85848.480321428564,205016.13392843501,15245.512150000006,5580,0,"","",null,null,null,null,null,null,0,0,null,null,2,108632.8807125]
[5204,"Sutton-at-Hone CEP School","","","",24556.494341605819,21229.112314914433,74031.450407950266,6654.1038353276272,6235,3.6399999999999988E-2,"","",null,null,null,null,null,null,0,0,null,null,1,4581.4757051666666]
[5209,"Allington Primary School","","","",5767.3177726218173,4908.8053009345804,59446.414690370511,11937.453683646121,6235,0,"","",null,null,null,null,null,null,0,0,null,null,1,0]
[5210,"St Botolph's CEP School","","","",80223.467472160381,29803.92344893112,75138.031501644247,27423.79368894612,6235,0,"","",null,null,null,null,null,null,0,0,null,null,1,33215.698862458332]
[5215,"Horton Kirby CEP School","","","",3342.304599999999,15191.535002120145,51593.931681675953,7751.6259256198373,6235,3.6399999999999988E-2,"","",null,null,null,null,null,null,0,0,null,null,1,0]
[5216,"Stella Maris Catholic Primary School","","","",55123.008649999923,16057.5175450237,52954.838247844709,7220.7330603351966,6235,0,"","",null,null,null,null,null,null,0,0,null,null,1,0]
[5217,"Our Lady of Hartley Catholic Primary School","","","",10662.351950000002,5808.6249059154943,33710.765203016745,1200.6080681318695,6235,3.6399999999999988E-2,"","",null,null,null,null,null,null,0,0,null,null,1,0]
[5219,"Wilmington Primary School","","","",7685.2992000000031,4214.9062800000011,36570.926802613321,3006.2395416666695,6235,3.6399999999999988E-2,"","",null,null,null,null,null,null,0,0,null,null,1,0]
[5220,"Halfway Houses Primary School","","","",109155.01362988807,47473.222125826789,119369.70685759044,7833.1777385032519,6235,0,"","",null,null,null,null,null,null,0,0,null,null,1,20616.64067325]
[5222,"St Joseph's Catholic Primary School, Northfleet","","","",41418.559100000013,9232.1284881355969,50447.155220882516,18258.303828571479,6235,0,"","",null,null,null,null,null,null,0,0,null,null,1,0]
[5228,"St George's Church of England Primary School","","","",64704.615400000002,20851.037489708742,77666.25839384865,2357.5371812154744,6235,0,"","",null,null,null,null,null,null,0,0,null,null,1,0]
[5400,"Wilmington Grammar School for Girls","","","",94146.683600280507,24385.945134782607,4770.3061280116799,8374.3780036671378,5580,3.6399999999999988E-2,"","",null,null,null,null,null,null,0,0,null,null,2,54316.440356250001]
[5401,"Maplesden Noakes School, The","","","",84778.456800000189,96913.196502572056,254029.59168923969,24973.99783501614,5580,0,"","",null,null,null,null,null,null,0,0,null,null,2,40263.700296875009]
[5403,"Wilmington Grammar School for Boys","","","",83816.751446525916,36540.599738424651,10303.62188263785,5551.3754918256127,5580,3.6399999999999988E-2,"","",null,null,null,null,null,null,0,0,null,null,2,25768.768190000006]
[5404,"Saint George's CE School","","","",163784.20960122312,95138.401070686828,315125.30215622584,10112.198422073519,5580,0,"","",null,null,null,null,null,null,0,0,null,null,4,48316.440356250008]
[5406,"Dartford Grammar School","","","",126417.16770000001,34030.982669580415,7759.3218254295762,29471.379582665897,5580,3.6399999999999988E-2,"","",null,null,null,null,null,null,0,0,null,null,2,0]
[5408,"Homewood School and Sixth Form Centre","","","",130209.78280000002,203021.15270257968,535986.82997465588,24961.945909042497,5580,0,"","",null,null,null,null,null,null,0,0,null,null,2,6000]
[5409,"Wrotham School","","","",30230.59992396141,53825.029069486402,200069.76799847267,0,5580,0,"","",null,null,null,null,null,null,0,0,null,null,2,0]
[5411,"Dartford Grammar School for Girls","","","",132056.05585,45093.101169017958,6359.8151252791577,47122.492099999952,5580,3.6399999999999988E-2,"","",null,null,null,null,null,null,0,0,null,null,2,32210.960237500007]
[5414,"Fulston Manor School","","","",210750.31745000006,104886.78884092218,271141.98975463037,1388.5930537107515,5580,0,"","",null,null,null,null,null,null,0,0,null,null,2,0]
[5416,"Cranbrook School","","","",4287.9566500000055,6068.6813449263154,15714.30472329952,38876.680286846815,5580,0,"","",null,null,null,null,null,null,0,0,null,null,2,0]
[5418,"Skinners' School, The","","","",16501.378100000009,9549.7220196078415,4479.0853667795436,41794.382441634269,5580,0,"","",null,null,null,null,null,null,0,0,null,null,2,16105.480118750003]
[5421,"Canterbury Academy, The","","","",232034.43582738622,182223.53486619715,318649.39049213985,19403.379099999933,5580,0,207.75798142367603,207.75798142367603,null,null,25,0,25,0,0,21,null,null,2,9663.2880712500028]
[5422,"Oakwood Park Grammar School, Maidstone","","","",44945.99135000004,28795.683222164276,8301.0471384080738,8315.7339000000011,5580,0,"","",null,null,null,null,null,null,0,0,null,null,2,0]
[5428,"Sir Roger Manwood's School","","","",69914.638216708903,33537.718819687499,9454.5241452777609,16631.467800000057,5580,0,"","",null,null,null,null,null,null,0,0,null,null,2,0]
[5432,"St Simon Stock Catholic School, Maidstone","","","",92250.532940668141,55217.874999414518,203662.82204885434,20789.334749999965,5580,0,"","",null,null,null,null,null,null,0,0,null,null,2,0]
[5434,"Westlands School, The","","","",257637.6473999999,186440.91446716519,437752.37881500478,8326.8959589261685,5580,0,960.74008760577362,960.74008760577362,349.25880105758478,349.25880105758478,24,10,26,0,0,30,null,null,2,0]
[5435,"St Gregory's Catholic School","","","",53673.401155965897,77614.711527222767,268509.86951580248,43086.799439526112,5580,0,915.38610530488859,915.38610530488859,null,null,10,0,9,0,0,7,null,null,2,0]
[5437,"Folkestone School for Girls, The","","","",129170.91466006608,42508.475434409796,22078.669735461954,11087.645199999999,5580,0,"","",null,null,null,null,null,null,0,0,null,null,2,0]
[5439,"Mascalls Academy","","","",40029.952089112157,96510.748936419855,300757.07387265371,13872.509356542052,5580,0,"","",null,null,null,null,null,null,0,0,null,null,2,0]
[5443,"Tonbridge Grammar School","","","",16735.245964501679,9500.8915684329186,830.22494251637659,12487.56904804029,5580,0,"","",null,null,null,null,null,null,0,0,null,null,2,0]
[5444,"Barton Court Grammar School","","","",63859.032350000009,41087.691614590163,6322.64245675244,2771.9112999999979,5580,0,"","",null,null,null,null,null,null,0,0,null,null,2,0]
[5446,"St Anselm's Catholic School, Canterbury","","","",147325.9184847236,98370.486728684205,253992.90148970744,18017.423450000042,5580,0,910.74008760577362,910.74008760577362,686.56069070433023,686.56069070433023,10,0,18,0,0,11,null,null,2,0]
[5448,"Herne Bay High School","","","",160876.9269969158,150025.8721029748,263242.15415798069,11087.645199999995,5580,0,"","",null,null,null,null,null,null,0,0,null,null,2,0]
[5449,"Queen Elizabeth's Grammar School","","","",62698.23195000003,23598.443829918033,7478.2431243718365,4192.1822205639655,5580,0,"","",null,null,null,null,null,null,0,0,null,null,2,0]
[5450,"Hillview School for Girls","","","",51940.856942144397,69138.139088666663,220993.3906813105,13859.55650000005,5580,0,"","",null,null,null,null,null,null,0,0,null,null,2,0]
[5455,"Hayesbrook School, The","","","",36199.960750000027,51399.432991102032,138679.40565855918,9723.8902125858094,5580,0,"","",null,null,null,null,null,null,0,0,null,null,2,0]
[5460,"Dane Court Grammar School","","","",174380.23939999985,62566.395282711863,5852.6862619119693,5587.7713635334067,5580,0,"","",null,null,null,null,null,null,0,0,null,null,2,0]
[5462,"Chatham & Clarendon Grammar School","","","",193788.62194999988,73868.845469777778,8061.266981974054,4174.6664124242425,5580,0,"","",null,null,null,null,null,null,0,0,null,null,2,0]
[5463,"Sandwich Technology School","","","",212481.51115000009,164624.6501446543,328062.40247492807,4157.8669500000042,5580,0,"","",null,null,null,null,null,null,0,0,null,null,2,0]
[5464,"Bennett Memorial Diocesan School","","","",33611.838148591538,54932.525560747359,242949.35414928661,20870.797660462336,5580,0,"","",null,null,null,null,null,null,0,0,null,null,2,60316.440356250001]
[5465,"Gravesend Grammar School","","","",135918.71925000014,32819.786000917426,12474.287567756057,5575.5015862857126,5580,0,"","",null,null,null,null,null,null,0,0,null,null,2,0]
[5466,"Brockhill Park Performing Arts College","","","",211686.56026795812,161756.87300955519,382799.07329722366,4161.2227748184041,5580,0,"","",null,null,null,null,null,null,0,0,null,null,2,0]
[5467,"Mayfield Grammar School, Gravesend","","","",117296.54509015074,41327.268430099008,9665.175775102196,4157.8669499999969,5580,0,"","",null,null,null,null,null,null,0,0,null,null,2,81695.756558124995]
[6464,"Stone Lodge School","","","",10940.146517408646,7654.2985533830397,15941.218723440048,1401.7194529104484,3255,3.6399999999999988E-2,"","",null,null,null,null,null,null,0,0,null,null,2,0]
[6905,"Knole Academy","","","",57849.888899999976,99094.026338310083,282956.79656732187,9701.6895500000028,5580,3.6399999999999988E-2,"","",null,null,null,null,null,null,0,0,null,null,2,6000]
[6909,"Marsh Academy, The","","","",157529.23054976526,156256.85372084682,348678.64836334635,4157.8669499999987,5580,0,612.2380375777152,612.2380375777152,null,null,8,0,12,0,0,4,null,null,2,0]
[6910,"Leigh Academy, The","","","",187889.62241631263,138078.85254986299,332417.47235042654,22250.460875932193,5580,3.6399999999999988E-2,1045.0424131871689,1045.0424131871689,273.26522780048754,273.26522780048754,11,0,10,0,0,15,null,null,2,25768.768190000006]
[6911,"Spires Academy","","","",154267.16542141617,132926.60456804122,205660.48430602552,16746.96410416664,5580,0,"","",null,null,null,null,null,null,0,0,null,null,2,48316.440356250008]
[6912,"New Line Learning Academy","","","",182996.18030000001,135045.95168021391,239558.02062749784,30491.024300000037,5580,0,"","",null,null,null,null,null,null,0,0,null,null,2,0]
[6913,"Cornwallis Academy","","","",159945.28614999994,128520.6400129315,381904.20605262456,26333.157350000009,5580,0,"","",null,null,null,null,null,null,0,0,null,null,2,0]
[6914,"Longfield Academy","","","",108874.29961725324,111784.49275024389,243663.58644591199,1387.5252486976242,5580,3.6399999999999988E-2,616.52440176785956,616.52440176785956,null,null,34,0,36,0,32,39,null,null,2,19326.576142500006]
[6915,"Oasis Academy Isle of Sheppey","","","",598973.00639999961,334567.97821961984,492818.07396913506,18017.423449999998,5580,0,"","",null,null,null,null,null,null,0,0,null,null,2,0]
[6916,"Skinners Kent Academy, The","","","",97779.916114592605,120840.47628230767,338758.04269559518,11124.359256953645,5580,0,"","",null,null,null,null,null,null,0,0,null,null,2,0]
[6917,"Dover Christ Church Academy","","","",222258.25245000032,147327.06945483873,229730.57998449236,2784.4728315710008,5580,0,492.30985357831531,492.30985357831531,null,null,38,0,38,0,38,35,null,null,2,0]
[6918,"Duke of York's Royal Military School","","","",0,11783.124749999999,104457.06778653523,49894.403399999996,5580,0,"","",null,null,null,null,null,null,0,0,null,null,2,0]
[6919,"John Wallis Church of England Academy, The",4,0.9,0.48,367676.00080678047,240252.24005129535,504388.61220892624,67943.687724620075,5580,0,367.43277817164335,367.43277817164335,null,null,4,0,3,0,5,2,null,null,4,0]
[6920,"Wilmington Academy","","","",108184.59589999997,98281.428020249266,325003.77740324603,26380.948924137891,5580,3.6399999999999988E-2,688.58274952785985,688.58274952785985,null,null,3,0,10,0,2,11,null,null,2,114632.8807125]
[8282,"River Mill Primary School","","","",4176.0158551244349,2396.7372319522256,7262.5622485266585,1268.5623847304887,3637.0833333333335,3.6399999999999988E-2,"","",null,null,null,null,null,null,0,0,null,null,1,0]

{"sheet":"Home","index":4,"n_rows":20,"n_cols":6,"rows_kept":20,"cut":false,"hidden":false,"merged":[]}
[]
[]
[]
[]
[]
[]
[]
[]
[null,null,null,null,null,{"$f":"IF(dfenum<1,\"Please select your DFE number to begin…\",\"\")","v":""}]
[]
[null,"Please enter your DfE number:",null,null,null,2009]
[]
[null,{"$f":"IF(ISERROR(VLOOKUP(dfenum,academies,2,0)),\"\",(VLOOKUP(dfenum,academies,2,0)))","v":"Northdown Primary School"}]
[null,"Phase:",{"$f":"IF(ISERROR(VLOOKUP(dfenum,academies,24,0)),\"\",(VLOOKUP(dfenum,academies,24,0)))","v":1}]
[]
[]
[]
[null,"The templates in this file are intended to provide a means to forecast and reconcile funding due from Kent County Council."]
[null,"All funding due from Kent County Council to academies is paid on the Dedicated Schools Grant financial year April 2018 to March 2019"]
[null,"If you have any queries about funding due from Kent County Council, please refer to the guidance documents provided on KELSI in the first instance (documents - funding guidance, input guidance)."]

{"sheet":"Early Years","index":5,"n_rows":143,"n_cols":6,"rows_kept":143,"cut":false,"hidden":false,"merged":[[138,2,138,4],[138,5,138,7],[138,8,138,10],[140,1,140,4],[142,1,142,4],[136,2,136,4],[136,5,136,7],[136,8,136,10],[137,2,137,4],[137,5,137,7],[137,8,137,10],[72,2,72,4],[72,8,72,10],[104,1,104,3],[106,2,106,4],[12,4,12,5],[16,1,16,3],[17,2,17,4],[17,8,17,10],[70,1,70,4],[8,4,8,5],[9,4,9,5],[10,4,10,5],[11,4,11,5],[4,1,4,5],[6,1,6,5]]}
[]
[null,null,null,null,null,{"$f":"dfenum","v":2009}]
[]
[]
[null,{"$f":"Home!B13","v":"Northdown Primary School"}]
[]
[null,"2019/20 Early Years Budget Estimation"]
[]
[null,"Hourly Rate",null,null,"Hourly rate"]
[null,"Base rate",null,null,{"$f":"IFERROR(VLOOKUP(dfenum,data,3,0),0)","v":4}]
[null,"Qualified Teacher Supplement",null,null,{"$f":"IFERROR(VLOOKUP(dfenum,data,4,0),0)","v":0.9}]
[null,"Disadvantage supplement",null,null,{"$f":"IFERROR(VLOOKUP(dfenum,data,5,0),0)","v":0.61}]
[null,null,null,null,{"$f":"SUM(E10:E12)","v":5.5100000000000007}]
[]
[null,"Please Enter your Pupil Numbers"]
[]
[null,"Please only enter qualifying pupils (follow link for guidance)"]
[null,null,"2019/20",null,null,"2020/21"]
[null,"Pupils Early Years Hours","Summer","Autumn","Spring","Summer (Rates may be revised as new Local Authority funding period)"]
[null,1]
[null,2]
[null,3]
[null,4]
[null,5]
[null,6]
[null,7]
[null,8]
[null,9]
[null,10]
[null,11]
[null,12]
[null,13]
[null,14]
[null,15]
[null,16]
[null,17]
[null,18]
[null,19]
[null,20]
[null,21]
[null,22]
[null,23]
[null,24]
[null,25]
[null,26]
[null,27]
[null,28]
[null,29]
[null,30]
[null,"Total pupils:",{"$f":"SUM(C20:C49)","v":0},0,0,0]
[null,"Total Weekly Hours:",{"$f":"SUMPRODUCT(C20:C49,$B$20:$B$49)","v":0},{"$f":"SUMPRODUCT(D20:D49,$B$20:$B$49)","v":0},0,0]
[null,"Total Hours for Term:",{"$f":"C51*$E$55","v":0},{"$f":"D51*$E$56","v":0},{"$f":"E51*$E$57","v":0},{"$f":"F51*$E$55","v":0}]
[]
[null,null,"Hourly Rate","Weekly Hours","Weeks"]
[null,"Summer term 2019",{"$f":"$E$13","v":5.5100000000000007},{"$f":"C51","v":0},13,{"$f":"SUM(D55*E55)*C55","v":0}]
[null,"Autumn term 2019",{"$f":"$E$13","v":5.5100000000000007},{"$f":"D51","v":0},14,{"$f":"SUM(D56*E56)*C56","v":0}]
[null,"Spring term 2020",5.5100000000000007,{"$f":"E51","v":0},11,{"$f":"SUM(D57*E57)*C57","v":0}]
[null,"Summer term 2020",5.5100000000000007,{"$f":"F51","v":0},13,{"$f":"SUM(D58*E58)*C58","v":0}]
[]
[]
[null,"Total 2019/20 Financial Year Estimated Budget (April 2019 to March 2020): ",null,null,null,{"$f":"SUM(F55:F57)","v":0}]
[]
[null,"Total 2019/20 Academic Year Estimated Budget (September 2019 to August 2020):",null,null,null,{"$f":"SUM($F$56:$F$58)","v":0}]
[]
[null,"Total Estimated Budget (April 2019 to August 2020):",null,null,null,{"$f":"SUM($F$55:$F$58)","v":0}]
[]
[]
[]
[null,"Early Years Pupil Premium (EYPP)"]
[]
[null,"Please only enter pupils who qualify for the Early Years Pupil Premium"]
[]
[null,null,"2019/20",null,null,"2020/21"]
[null,"Pupils Early Years Hours","Summer","Autumn","Spring","Summer (Rates may be revised as new Local Authority funding period)"]
[null,1]
[null,2]
[null,3]
[null,4]
[null,5]
[null,6]
[null,7]
[null,8]
[null,9]
[null,10]
[null,11]
[null,12]
[null,13]
[null,14]
[null,15]
[null,"Total pupils:",{"$f":"SUM(C75:C89)","v":0},{"$f":"SUM(D75:D89)","v":0},{"$f":"SUM(E75:E89)","v":0},{"$f":"SUM(F75:F89)","v":0}]
[null,"Total Weekly Hours:",{"$f":"SUMPRODUCT(C75:C89,$B$75:$B$89)","v":0},{"$f":"SUMPRODUCT(D75:D89,$B$75:$B$89)","v":0},0,0]
[null,"Total Hours for Term:",{"$f":"C91*13","v":0},{"$f":"D91*14","v":0},{"$f":"E91*11","v":0},{"$f":"F91*13","v":0}]
[null,"Rate per funded hour:",0.53,0.53,0.53,0.53]
[null,"Estimated Pupil Premium Funding:",{"$f":"C92*C93","v":0},{"$f":"D92*D93","v":0},0,0]
[]
[null,"Total 2019/20 Financial Year Estimated Budget (April 2019 to March 2020): ",null,null,null,{"$f":"SUM($C$94:$E$94)","v":0}]
[]
[null,"Total 2019/20 Academic Year Estimated Budget (September 2019 to August 2020):",null,null,null,{"$f":"SUM($D$94:$F$94)","v":0}]
[]
[null,"Total Estimated Budget (April 2019 to August 2020):",null,null,null,{"$f":"SUM($C$94:$F$94)","v":0}]
[]
[]
[null,"2 Year old funding"]
[]
[null,"Please only enter pupils who qualify for the 2 Year old funding"]
[]
[null,null,"2019/20",null,null,"2020/21"]
[null,"Pupils Early Years Hours","Summer","Autumn","Spring","Summer (Rates may be revised as new Local Authority funding period)"]
[null,1]
[null,2]
[null,3]
[null,4]
[null,5]
[null,6]
[null,7]
[null,8]
[null,9]
[null,10]
[null,11]
[null,12]
[null,13]
[null,14]
[null,15]
[null,"Total pupils:",{"$f":"SUM(C109:C123)","v":0},{"$f":"SUM(D109:D123)","v":0},{"$f":"SUM(E109:E123)","v":0},{"$f":"SUM(F109:F123)","v":0}]
[null,"Total Weekly Hours:",{"$f":"SUMPRODUCT(C109:C123,$B$109:$B$123)","v":0},{"$f":"SUMPRODUCT(D109:D123,$B$109:$B$123)","v":0},0,0]
[null,"Total Hours for Term:",{"$f":"C125*13","v":0},{"$f":"D125*14","v":0},{"$f":"E125*11","v":0},{"$f":"F125*13","v":0}]
[null,"Rate per funded hour:",5.0199999999999996,5.0199999999999996,5.0199999999999996,5.0199999999999996]
[null,"Estimated 2 Year old Funding:",{"$f":"C126*C127","v":0},{"$f":"D126*D127","v":0},0,0]
[]
[null,"Total 2019/20 Financial Year Estimated Budget (April 2019 to March 2020): ",null,null,null,{"$f":"SUM($C$128:$E$128)","v":0}]
[]
[null,"Total 2019/20 Academic Year Estimated Budget (September 2019 to August 2020):",null,null,null,{"$f":"SUM($D$128:$F$128)","v":0}]
[]
[null,"Total Estimated Budget (April 2019 to August 2020):",null,null,null,{"$f":"SUM($C$128:$F$128)","v":0}]
[]
[]
[null,null,"2019/20"]
[null,"Disability Access Fund (DAF)"]
[null,"Special Educational Needs Inclusion Fund (SENIF)"]
[]
[null,"Please only enter funding for pupils who qualify for the DAF funding"]
[]
[null,"Please only enter funding for pupils who qualify for the SENIF funding"]

{"sheet":"High Needs Mainstream","index":6,"n_rows":85,"n_cols":111,"rows_kept":85,"cut":false,"hidden":false,"merged":[[87,2,87,10],[87,15,87,27],[87,29,87,41],[87,43,87,55],[80,12,80,13],[82,2,82,10],[82,12,82,13],[83,2,83,10],[84,2,84,10],[85,2,85,10],[79,12,79,13],[68,12,68,13],[69,12,69,13],[70,12,70,13],[71,12,71,13],[72,12,72,13],[73,12,73,13],[74,12,74,13],[75,12,75,13],[76,12,76,13],[77,12,77,13],[78,12,78,13],[67,12,67,13],[56,12,56,13],[57,12,57,13],[58,12,58,13],[59,12,59,13],[60,12,60,13],[61,12,61,13],[62,12,62,13],[63,12,63,13],[64,12,64,13],[65,12,65,13],[66,12,66,13],[55,12,55,13],[44,12,44,13],[45,12,45,13],[46,12,46,13],[47,12,47,13],[48,12,48,13],[49,12,49,13],[50,12,50,13],[51,12,51,13],[52,12,52,13],[53,12,53,13],[54,12,54,13],[43,12,43,13],[32,12,32,13],[33,12,33,13],[34,12,34,13],[35,12,35,13],[36,12,36,13],[37,12,37,13],[38,12,38,13],[39,12,39,13],[40,12,40,13],[41,12,41,13],[42,12,42,13],[31,12,31,13],[20,12,20,13],[21,12,21,13],[22,12,22,13],[23,12,23,13],[24,12,24,13],[25,12,25,13],[26,12,26,13],[27,12,27,13],[28,12,28,13],[29,12,29,13],[30,12,30,13],[15,12,15,13],[16,12,16,13],[17,12,17,13],[18,12,18,13],[19,12,19,13],[14,72,14,74],[3,3,3,13],[4,3,4,13],[9,29,9,40],[9,72,9,74],[11,2,11,10],[12,2,12,10],[14,2,14,13],[14,15,14,27],[14,29,14,41],[14,43,14,55]]}
[null,null,null,null,null,null,null,null,null,null,null,null,null,null,null,"Notional SEN budget top up rate working"]
[null,null,null,{"$f":"dfenum","v":2009},null,null,null,null,null,null,null,null,null,null,null,"Notional AEN/SEN Budget"]
[null,null,null,null,null,null,null,null,null,null,null,null,null,null,null,null,null,null,"IDACI",null,null,{"$f":"IF(ISERROR(VLOOKUP(dfenum,Data!A:X,6,0)),0,VLOOKUP(dfenum,Data!A:X,6,0))","v":130319.8587}]
[null,null,null,{"$f":"Home!B13","v":"Northdown Primary School"},null,null,null,null,null,null,null,null,null,null,null,null,null,null,"Ever 6 FSM",null,null,{"$f":"IF(ISERROR(VLOOKUP(dfenum,Data!A:X,7,0)),0,VLOOKUP(dfenum,Data!A:X,7,0))","v":60841.413813781524}]
[null,null,null,"2019/20",null,null,null,null,null,null,null,null,null,null,null,null,null,null,"Low Cost, high Incidence SEN",null,null,{"$f":"IF(ISERROR(VLOOKUP(dfenum,Data!A:X,8,0)),0,VLOOKUP(dfenum,Data!A:X,8,0))","v":103564.8310212222}]
[null,null,null,null,null,null,null,null,null,null,null,null,null,null,null,null,null,null,"English as an additional language",null,null,{"$f":"IF(ISERROR(VLOOKUP(dfenum,Data!A:X,9,0)),0,VLOOKUP(dfenum,Data!A:X,9,0))","v":14858.785638686139}]
[null,null,null,null,null,null,null,null,null,null,null,null,null,null,null,null,null,null,"Element of Lump Sum",null,null,{"$f":"IF(ISERROR(VLOOKUP(dfenum,Data!A:X,10,0)),0,VLOOKUP(dfenum,Data!A:X,10,0))","v":6235}]
[null,null,null,null,null,null,null,null,null,null,null,null,null,null,null,null,null,null,"Area Cost Adjustment-London Fringe",null,null,{"$f":"IFERROR(VLOOKUP(dfenum,Data!A4:K400,11,0),0)*SUM(V3:V7)","v":0}]
[null,null,null,null,null,null,null,null,null,null,null,null,null,null,null,null,null,null,"Total (with Area Cost Adjustment if applicable)",null,null,null,null,{"$f":"SUM(V3:V8)","v":315819.88917368988}]
[null,null,null,null,null,null,null,null,null,null,null,null,null,null,null,"School Contribution per Pre-16 Pupil",null,null,null,null,null,null,null,6000,null,null,null,null,null,"Extra top up due to 28% rule"]
[null,null,null,null,null,null,null,null,null,null,null,null,null,null,null,"Notional AEN/SEN Top Up per Pre-16 Pupil (10%)",null,null,null,null,null,null,null,{"$f":"IF(dfenum=1001,0,IF(X9>=60000,0,6000-(X9*0.1)))","v":0},null,null,null,null,null,{"$f":"IF(BF15>=senmax,\"Y\",\"N\")","v":"N"},"N","N","N","N","N","N","N","N","N","N","N","Total"]
[null,null,null,null,null,null,null,null,null,null,null,null,null,null,null,"Maximum Contribution for all Pre-16 Pupils (28%)",null,null,null,null,null,null,null,{"$f":"X9*0.28","v":88429.568968633175},null,null,null,null,null,{"$f":"BF13","v":0},{"$f":"BG13-AD12","v":0},{"$f":"BH13-SUM(AD12:AE12)","v":0},{"$f":"BI13-SUM(AD12:AF12)","v":0},{"$f":"BJ13-SUM(AD12:AG12)","v":0},{"$f":"BK13-SUM(AD12:AH12)","v":0},{"$f":"BL13-SUM(AD12:AI12)","v":0},{"$f":"BM13-SUM(AD12:AJ12)","v":0},{"$f":"BN13-SUM(AD12:AK12)","v":0},{"$f":"BO13-SUM(AD12:AL12)","v":0},{"$f":"BP13-SUM(AD12:AM12)","v":0},{"$f":"BQ13-SUM(AD12:AN12)","v":0},{"$f":"SUM(AD12:AO12)","v":0}]
[null,null,null,null,null,null,null,null,null,null,null,null,null,null,null,null,null,null,null,null,null,null,null,null,null,null,null,null,null,null,null,null,null,null,null,null,null,null,null,null,null,null,null,null,null,null,null,null,null,null,null,null,null,null,null,null,null,{"$f":"IF(BF15-senmax<0,0,BF15-senmax)","v":0},0,0,0,0,0,0,0,0,0,0,0]
[null,null,null,null,"2018-09-01","2019-09-01"]
[null,null,"Pupil Data",null,null,null,null,null,null,null,null,null,null,null,null,"Element 3 top up",null,null,null,null,null,null,null,null,null,null,null,null,null,"Notional SEN budget top up",null,null,null,null,null,null,null,null,null,null,null,null,null,"Post 16 Element 2",null,null,null,null,null,null,null,null,null,null,null,null,null,{"$f":"BF16","v":0},{"$f":"BG16+BF15","v":0},0,0,0,0,0,0,0,0,0,{"$f":"BQ16+BP15","v":0},null,null,null,"2020/21"]
[null,null,"Name","Date of Birth","Year Group (Academic Year Sept 18 - Aug 19)","Year Group (Academic Year Sept 19 - Aug 20)","Start Date","End Date","Year 1 - Period 1 - (Apr to Aug)\nMonthly top up rate","Year 1 - Period 2 - (Sep to Dec)\nMonthly top up rate","Year 1 - Period 3 - (Jan to Mar)\nMonthly top up rate","Year 2 Monthly top up rate","Year 1 Total Funding linked to this Pupil",null,null,"April","May","June","July","August","September","October","November","December","January","February","March","Total",null,"April","May","June","July","August","September","October","November","December","January","February","March","Total",null,"April","May","June","July","August","September","October","November","December","January","February","March","Total",null,{"$f":"SUM(BF17:BF81)","v":0},{"$f":"SUM(BG17:BG81)","v":0},0,0,0,0,0,0,0,0,0,0,"Name","Pupil present between April and August","September to March Indicator","April to August (£)","Notional SEN Budget Top Up (Rates may be revised as new Local Authority funding period)","Post 16 Element 2",null,null,null,"April","May","June","July","August","September","October","November","December","January","February","March","Age1","Age2","Pre months","Post months",null,"April","May","June","July","August","September","October","November","December","January","February","March","Age1","Age2","Pre months","Post months"]
[null,null,null,null,{"$f":"IF(D17=\"\",\"\",IF(SUM(DATEDIF(D17,DATE(YEAR($E$14)+(MONTH($E$14)>8),8,31),\"Y\")-5)=0,\"R\",IF(SUM(DATEDIF(D17,DATE(YEAR($E$14)+(MONTH($E$14)>8),8,31),\"Y\")-5)<0,\"\",DATEDIF(D17,DATE(YEAR($E$14)+(MONTH($E$14)>8),8,31),\"Y\")-5)))","v":""},{"$f":"IF(D17=\"\",\"\",IF(SUM(DATEDIF(D17,DATE(YEAR($F$14)+(MONTH($F$14)>8),8,31),\"Y\")-5)=0,\"R\",DATEDIF(D17,DATE(YEAR($F$14)+(MONTH($F$14)>8),8,31),\"Y\")-5))","v":""},"2019-04-01",null,null,null,null,null,{"$f":"AB17+AP17+BD17","v":0},null,null,{"$f":"IF(AND($G17<DATE(2019,5,1),$H17>=DATE(2019,4,1)),$I17,0)","v":0},{"$f":"IF(AND($G17<DATE(2019,6,1),$H17>=DATE(2019,4,1)),$I17,0)","v":0},{"$f":"IF(AND($G17<DATE(2019,7,1),$H17>=DATE(2019,4,1)),$I17,0)","v":0},{"$f":"IF(AND($G17<DATE(2019,8,1),$H17>=DATE(2019,4,1)),$I17,0)","v":0},{"$f":"IF(AND($G17<DATE(2019,9,1),$H17>=DATE(2019,4,1)),$I17,0)","v":0},{"$f":"IF(AND($G17<DATE(2019,10,1),$H17>=DATE(2019,9,1)),$J17,0)","v":0},{"$f":"IF(AND($G17<DATE(2019,11,1),$H17>=DATE(2019,9,1)),$J17,0)","v":0},{"$f":"IF(AND($G17<DATE(2019,12,1),$H17>=DATE(2019,9,1)),$J17,0)","v":0},{"$f":"IF(AND($G17<DATE(2020,1,1),$H17>=DATE(2019,9,1)),$J17,0)","v":0},{"$f":"IF(AND($G17<DATE(2020,2,1),$H17>=DATE(2020,1,1)),$K17,0)","v":0},{"$f":"IF(AND($G17<DATE(2020,3,1),$H17>=DATE(2020,1,1)),$K17,0)","v":0},{"$f":"IF(AND($G17<DATE(2020,4,1),$H17>=DATE(2020,1,1)),$K17,0)","v":0},{"$f":"SUM(P17:AA17)","v":0},null,{"$f":"IF(AND(P17>0,$D17>DATE(2002,8,31)),sentopup/12,0)","v":0},{"$f":"IF(AND(Q17>0,$D17>DATE(2002,8,31)),sentopup/12,0)","v":0},{"$f":"IF(AND(R17>0,$D17>DATE(2002,8,31)),sentopup/12,0)","v":0},{"$f":"IF(AND(S17>0,$D17>DATE(2002,8,31)),sentopup/12,0)","v":0},{"$f":"IF(AND(T17>0,$D17>DATE(2002,8,31)),sentopup/12,0)","v":0},{"$f":"IF(AND(U17>0,$D17>DATE(2003,8,1)),sentopup/12,0)","v":0},{"$f":"IF(AND(V17>0,$D17>DATE(2003,8,1)),sentopup/12,0)","v":0},{"$f":"IF(AND(W17>0,$D17>DATE(2003,8,1)),sentopup/12,0)","v":0},{"$f":"IF(AND(X17>0,$D17>DATE(2003,8,1)),sentopup/12,0)","v":0},{"$f":"IF(AND(Y17>0,$D17>DATE(2003,8,1)),sentopup/12,0)","v":0},{"$f":"IF(AND(Z17>0,$D17>DATE(2003,8,1)),sentopup/12,0)","v":0},{"$f":"IF(AND(AA17>0,$D17>DATE(2003,8,1)),sentopup/12,0)","v":0},{"$f":"SUM(AD17:AO17)","v":0},null,{"$f":"IF(AND(P17>0,$D17<DATE(2002,9,1),$D17>1),500,0)","v":0},{"$f":"IF(AND(Q17>0,$D17<DATE(2002,9,1),$D17>1),500,0)","v":0},{"$f":"IF(AND(R17>0,$D17<DATE(2002,9,1),$D17>1),500,0)","v":0},{"$f":"IF(AND(S17>0,$D17<DATE(2002,9,1),$D17>1),500,0)","v":0},{"$f":"IF(AND(T17>0,$D17<DATE(2002,9,1),$D17>1),500,0)","v":0},{"$f":"IF(AND(U17>0,$D17<DATE(2003,9,1),$D17>1),500,0)","v":0},0,0,0,0,0,0,{"$f":"SUM(AR17:BC17)","v":0},null,{"$f":"IF(P17>0,500-AD17-AR17,0)","v":0},{"$f":"IF(Q17>0,500-AE17-AS17,0)","v":0},0,0,0,0,0,0,0,0,0,0,{"$f":"IF(AA17>0,C17,\"\")","v":""},{"$f":"IF(H17>DATE(2020,3,1),\"Yes\",\"No\")","v":"No"},{"$f":"IF(H17>DATE(2020,8,31),\"Yes\",\"No\")","v":"No"},{"$f":"IFERROR(IF(BS17=\"Yes\",L17*SUM(CA17:CE17),0),\"\")","v":0},{"$f":"SUM(sentopup/12)*CO17","v":0},{"$f":"SUM(6000/12)*CP17","v":0},null,null,null,{"$f":"IF(AND($G17<DATE(2019,5,1),$H17>DATE(2019,3,31)),1,0)","v":0},{"$f":"IF(AND($G17<DATE(2019,6,1),$H17>DATE(2019,3,31)),1,0)","v":0},{"$f":"IF(AND($G17<DATE(2019,7,1),$H17>DATE(2019,3,31)),1,0)","v":0},{"$f":"IF(AND($G17<DATE(2019,8,1),$H17>DATE(2019,3,31)),1,0)","v":0},{"$f":"IF(AND($G17<DATE(2019,9,1),$H17>DATE(2019,3,31)),1,0)","v":0},null,null,null,null,null,null,null,{"$f":"IF(AND(D17>1,D17<DATE(2002,9,1)),\"post\",IF(AND(D17>1,D17>DATE(2002,8,31)),\"pre\",\"null\"))","v":"null"},{"$f":"IF(AND(D17>1,D17<DATE(2003,9,1)),\"post\",IF(AND(D17>1,D17>DATE(2003,8,31)),\"pre\",\"null\"))","v":"null"},{"$f":"IF(AND(CM17=\"pre\",CN17=\"pre\"),SUM(CA17:CL17),\nIF(AND(CM17=\"post\",CN17=\"post\"),0,\nIF(AND(CM17=\"pre\",CN17=\"post\"),SUM(CA17:CE17),0)))","v":0},{"$f":"IF(AND(CM17=\"pre\",CN17=\"pre\"),0,\nIF(AND(CM17=\"post\",CN17=\"post\"),SUM(CA17:CL17),\nIF(AND(CM17=\"pre\",CN17=\"post\"),SUM(CF17:CL17),0)))","v":0},null,{"$f":"IF(AND($G17<DATE(2020,5,1),$H17>DATE(2020,3,31)),1,0)","v":0},{"$f":"IF(AND($G17<DATE(2020,6,1),$H17>DATE(2020,3,31)),1,0)","v":0},{"$f":"IF(AND($G17<DATE(2020,7,1),$H17>DATE(2020,3,31)),1,0)","v":0},{"$f":"IF(AND($G17<DATE(2020,8,1),$H17>DATE(2020,3,31)),1,0)","v":0},{"$f":"IF(AND($G17<DATE(2020,9,1),$H17>DATE(2020,3,31)),1,0)","v":0},{"$f":"IF(AND($G17<DATE(2020,10,1),$H17>DATE(2020,8,31)),1,0)","v":0},{"$f":"IF(AND($G17<DATE(2020,11,1),$H17>DATE(2020,8,31)),1,0)","v":0},{"$f":"IF(AND($G17<DATE(2020,12,1),$H17>DATE(2020,8,31)),1,0)","v":0},{"$f":"IF(AND($G17<DATE(2021,1,1),$H17>DATE(2020,8,31)),1,0)","v":0},{"$f":"IF(AND($G17<DATE(2021,2,1),$H17>DATE(2020,12,31)),1,0)","v":0},{"$f":"IF(AND($G17<DATE(2021,3,1),$H17>DATE(2020,12,31)),1,0)","v":0},{"$f":"IF(AND($G17<DATE(2021,4,1),$H17>DATE(2020,12,31)),1,0)","v":0},{"$f":"IF(AND(D17>1,D17<DATE(2003,9,1)),\"post\",IF(AND(D17>1,D17>DATE(2003,8,31)),\"pre\",\"null\"))","v":"null"},{"$f":"IF(AND(D17>1,D17<DATE(2004,9,1)),\"post\",IF(AND(D17>1,D17>DATE(2004,8,31)),\"pre\",\"null\"))","v":"null"},{"$f":"IF(AND(DD17=\"pre\",DE17=\"pre\"),SUM(CR17:DC17),\nIF(AND(DD17=\"post\",DE17=\"post\"),0,\nIF(AND(DD17=\"pre\",DE17=\"post\"),SUM(CR17:CV17),0)))","v":0},{"$f":"IF(AND(DD17=\"pre\",DE17=\"pre\"),0,\nIF(AND(DD17=\"post\",DE17=\"post\"),SUM(CR17:DC17),\nIF(AND(DD17=\"pre\",DE17=\"post\"),SUM(CW17:DC17),0)))","v":0}]
[null,null,null,null,"","","2019-04-01",null,null,null,null,null,{"$f":"AB18+AP18+BD18","v":0},null,null,{"$f":"IF(AND($G18<DATE(2019,5,1),$H18>=DATE(2019,4,1)),$I18,0)","v":0},{"$f":"IF(AND($G18<DATE(2019,6,1),$H18>=DATE(2019,4,1)),$I18,0)","v":0},{"$f":"IF(AND($G18<DATE(2019,7,1),$H18>=DATE(2019,4,1)),$I18,0)","v":0},{"$f":"IF(AND($G18<DATE(2019,8,1),$H18>=DATE(2019,4,1)),$I18,0)","v":0},{"$f":"IF(AND($G18<DATE(2019,9,1),$H18>=DATE(2019,4,1)),$I18,0)","v":0},{"$f":"IF(AND($G18<DATE(2019,10,1),$H18>=DATE(2019,9,1)),$J18,0)","v":0},{"$f":"IF(AND($G18<DATE(2019,11,1),$H18>=DATE(2019,9,1)),$J18,0)","v":0},{"$f":"IF(AND($G18<DATE(2019,12,1),$H18>=DATE(2019,9,1)),$J18,0)","v":0},{"$f":"IF(AND($G18<DATE(2020,1,1),$H18>=DATE(2019,9,1)),$J18,0)","v":0},{"$f":"IF(AND($G18<DATE(2020,2,1),$H18>=DATE(2020,1,1)),$K18,0)","v":0},{"$f":"IF(AND($G18<DATE(2020,3,1),$H18>=DATE(2020,1,1)),$K18,0)","v":0},{"$f":"IF(AND($G18<DATE(2020,4,1),$H18>=DATE(2020,1,1)),$K18,0)","v":0},{"$f":"SUM(P18:AA18)","v":0},null,0,0,0,0,0,0,0,0,0,0,0,0,{"$f":"SUM(AD18:AO18)","v":0},null,{"$f":"IF(AND(P18>0,$D18<DATE(2002,9,1),$D18>1),500,0)","v":0},{"$f":"IF(AND(Q18>0,$D18<DATE(2002,9,1),$D18>1),500,0)","v":0},{"$f":"IF(AND(R18>0,$D18<DATE(2002,9,1),$D18>1),500,0)","v":0},{"$f":"IF(AND(S18>0,$D18<DATE(2002,9,1),$D18>1),500,0)","v":0},{"$f":"IF(AND(T18>0,$D18<DATE(2002,9,1),$D18>1),500,0)","v":0},{"$f":"IF(AND(U18>0,$D18<DATE(2003,9,1),$D18>1),500,0)","v":0},{"$f":"IF(AND(V18>0,$D18<DATE(2003,9,1),$D18>1),500,0)","v":0},{"$f":"IF(AND(W18>0,$D18<DATE(2003,9,1),$D18>1),500,0)","v":0},{"$f":"IF(AND(X18>0,$D18<DATE(2003,9,1),$D18>1),500,0)","v":0},{"$f":"IF(AND(Y18>0,$D18<DATE(2003,9,1),$D18>1),500,0)","v":0},{"$f":"IF(AND(Z18>0,$D18<DATE(2003,9,1),$D18>1),500,0)","v":0},{"$f":"IF(AND(AA18>0,$D18<DATE(2003,9,1),$D18>1),500,0)","v":0},{"$f":"SUM(AR18:BC18)","v":0},null,{"$f":"IF(P18>0,500-AD18-AR18,0)","v":0},0,0,0,0,0,0,0,0,0,0,0,null,{"$f":"IF(H18>DATE(2020,3,1),\"Yes\",\"No\")","v":"No"},{"$f":"IF(H18>DATE(2020,8,31),\"Yes\",\"No\")","v":"No"},0,0,{"$f":"SUM(6000/12)*CP18","v":0},null,null,null,{"$f":"IF(AND($G18<DATE(2019,5,1),$H18>DATE(2019,3,31)),1,0)","v":0},{"$f":"IF(AND($G18<DATE(2019,6,1),$H18>DATE(2019,3,31)),1,0)","v":0},{"$f":"IF(AND($G18<DATE(2019,7,1),$H18>DATE(2019,3,31)),1,0)","v":0},{"$f":"IF(AND($G18<DATE(2019,8,1),$H18>DATE(2019,3,31)),1,0)","v":0},{"$f":"IF(AND($G18<DATE(2019,9,1),$H18>DATE(2019,3,31)),1,0)","v":0},null,null,null,null,null,null,null,"null","null",{"$f":"IF(AND(CM18=\"pre\",CN18=\"pre\"),SUM(CA18:CL18),\nIF(AND(CM18=\"post\",CN18=\"post\"),0,\nIF(AND(CM18=\"pre\",CN18=\"post\"),SUM(CA18:CE18),0)))","v":0},{"$f":"IF(AND(CM18=\"pre\",CN18=\"pre\"),0,\nIF(AND(CM18=\"post\",CN18=\"post\"),SUM(CA18:CL18),\nIF(AND(CM18=\"pre\",CN18=\"post\"),SUM(CF18:CL18),0)))","v":0},null,{"$f":"IF(AND($G18<DATE(2020,5,1),$H18>DATE(2020,3,31)),1,0)","v":0},{"$f":"IF(AND($G18<DATE(2020,6,1),$H18>DATE(2020,3,31)),1,0)","v":0},{"$f":"IF(AND($G18<DATE(2020,7,1),$H18>DATE(2020,3,31)),1,0)","v":0},{"$f":"IF(AND($G18<DATE(2020,8,1),$H18>DATE(2020,3,31)),1,0)","v":0},{"$f":"IF(AND($G18<DATE(2020,9,1),$H18>DATE(2020,3,31)),1,0)","v":0},{"$f":"IF(AND($G18<DATE(2020,10,1),$H18>DATE(2020,8,31)),1,0)","v":0},{"$f":"IF(AND($G18<DATE(2020,11,1),$H18>DATE(2020,8,31)),1,0)","v":0},{"$f":"IF(AND($G18<DATE(2020,12,1),$H18>DATE(2020,8,31)),1,0)","v":0},{"$f":"IF(AND($G18<DATE(2021,1,1),$H18>DATE(2020,8,31)),1,0)","v":0},{"$f":"IF(AND($G18<DATE(2021,2,1),$H18>DATE(2020,12,31)),1,0)","v":0},{"$f":"IF(AND($G18<DATE(2021,3,1),$H18>DATE(2020,12,31)),1,0)","v":0},{"$f":"IF(AND($G18<DATE(2021,4,1),$H18>DATE(2020,12,31)),1,0)","v":0},"null","null",{"$f":"IF(AND(DD18=\"pre\",DE18=\"pre\"),SUM(CR18:DC18),\nIF(AND(DD18=\"post\",DE18=\"post\"),0,\nIF(AND(DD18=\"pre\",DE18=\"post\"),SUM(CR18:CV18),0)))","v":0},{"$f":"IF(AND(DD18=\"pre\",DE18=\"pre\"),0,\nIF(AND(DD18=\"post\",DE18=\"post\"),SUM(CR18:DC18),\nIF(AND(DD18=\"pre\",DE18=\"post\"),SUM(CW18:DC18),0)))","v":0}]
[null,null,null,null,"","","2019-04-01",null,null,null,null,null,0,null,null,0,0,0,0,0,0,0,0,0,0,0,0,0,null,0,0,0,0,0,0,0,0,0,0,0,0,0,null,0,0,0,0,0,0,0,0,0,0,0,0,0,null,0,0,0,0,0,0,0,0,0,0,0,0,null,"No","No",0,0,0,null,null,null,0,0,0,0,0,null,null,null,null,null,null,null,"null","null",0,0,null,0,0,0,0,0,0,0,0,0,0,0,0,"null","null",0,0]
[null,null,null,null,"","","2019-04-01",null,null,null,null,null,0,null,null,0,0,0,0,0,0,0,0,0,0,0,0,0,null,0,0,0,0,0,0,0,0,0,0,0,0,0,null,0,0,0,0,0,0,0,0,0,0,0,0,0,null,0,0,0,0,0,0,0,0,0,0,0,0,null,"No","No",0,0,0,null,null,null,0,0,0,0,0,null,null,null,null,null,null,null,"null","null",0,0,null,0,0,0,0,0,0,0,0,0,0,0,0,"null","null",0,0]
[null,null,null,null,"","","2019-04-01",null,null,null,null,null,0,null,null,0,0,0,0,0,0,0,0,0,0,0,0,0,null,0,0,0,0,0,0,0,0,0,0,0,0,0,null,0,0,0,0,0,0,0,0,0,0,0,0,0,null,0,0,0,0,0,0,0,0,0,0,0,0,null,"No","No",0,0,0,null,null,null,0,0,0,0,0,null,null,null,null,null,null,null,"null","null",0,0,null,0,0,0,0,0,0,0,0,0,0,0,0,"null","null",0,0]
[null,null,null,null,"","","2019-04-01",null,null,null,null,null,0,null,null,0,0,0,0,0,0,0,0,0,0,0,0,0,null,0,0,0,0,0,0,0,0,0,0,0,0,0,null,0,0,0,0,0,0,0,0,0,0,0,0,0,null,0,0,0,0,0,0,0,0,0,0,0,0,null,"No","No",0,0,0,null,null,null,0,0,0,0,0,null,null,null,null,null,null,null,"null","null",0,0,null,0,0,0,0,0,0,0,0,0,0,0,0,"null","null",0,0]
[null,null,null,null,"","","2019-04-01",null,null,null,null,null,0,null,null,0,0,0,0,0,0,0,0,0,0,0,0,{"$f":"SUM(P23:AA23)","v":0},null,0,0,0,0,0,0,0,0,0,0,0,0,{"$f":"SUM(AD23:AO23)","v":0},null,0,0,0,0,0,0,0,0,0,0,0,0,{"$f":"SUM(AR23:BC23)","v":0},null,0,0,0,0,0,0,0,0,0,0,0,0,null,"No","No",0,0,0,null,null,null,0,0,0,0,0,null,null,null,null,null,null,null,"null","null",0,0,null,0,0,0,0,0,0,0,0,0,0,0,0,"null","null",0,0]
[null,null,null,null,"","","2019-04-01",null,null,null,null,null,0,null,null,0,0,0,0,0,0,0,0,0,0,0,0,0,null,0,0,0,0,0,0,0,0,0,0,0,0,0,null,0,0,0,0,0,0,0,0,0,0,0,0,0,null,0,0,0,0,0,0,0,0,0,0,0,0,null,"No","No",0,0,0,null,null,null,0,0,0,0,0,null,null,null,null,null,null,null,"null","null",0,0,null,0,0,0,0,0,0,0,0,0,0,0,0,"null","null",0,0]
[null,null,null,null,"","","2019-04-01",null,null,null,null,null,0,null,null,0,0,0,0,0,0,0,0,0,0,0,0,0,null,0,0,0,0,0,0,0,0,0,0,0,0,0,null,0,0,0,0,0,0,0,0,0,0,0,0,0,null,0,0,0,0,0,0,0,0,0,0,0,0,null,"No","No",0,0,0,null,null,null,0,0,0,0,0,null,null,null,null,null,null,null,"null","null",0,0,null,0,0,0,0,0,0,0,0,0,0,0,0,"null","null",0,0]
[null,null,null,null,"","","2019-04-01",null,null,null,null,null,0,null,null,0,0,0,0,0,0,0,0,0,0,0,0,0,null,0,0,0,0,0,0,0,0,0,0,0,0,0,null,0,0,0,0,0,0,0,0,0,0,0,0,0,null,0,0,0,0,0,0,0,0,0,0,0,0,null,"No","No",0,0,0,null,null,null,0,0,0,0,0,null,null,null,null,null,null,null,"null","null",0,0,null,0,0,0,0,0,0,0,0,0,0,0,0,"null","null",0,0]
[null,null,null,null,"","","2019-04-01",null,null,null,null,null,0,null,null,0,0,0,0,0,0,0,0,0,0,0,0,0,null,0,0,0,0,0,0,0,0,0,0,0,0,0,null,0,0,0,0,0,0,0,0,0,0,0,0,0,null,0,0,0,0,0,0,0,0,0,0,0,0,null,"No","No",0,0,0,null,null,null,0,0,0,0,0,null,null,null,null,null,null,null,"null","null",0,0,null,0,0,0,0,0,0,0,0,0,0,0,0,"null","null",0,0]
[null,null,null,null,"","","2019-04-01",null,null,null,null,null,0,null,null,0,0,0,0,0,0,0,0,0,0,0,0,0,null,0,0,0,0,0,0,0,0,0,0,0,0,0,null,0,0,0,0,0,0,0,0,0,0,0,0,0,null,0,0,0,0,0,0,0,0,0,0,0,0,null,"No","No",0,0,0,null,null,null,0,0,0,0,0,null,null,null,null,null,null,null,"null","null",0,0,null,0,0,0,0,0,0,0,0,0,0,0,0,"null","null",0,0]
[null,null,null,null,"","","2019-04-01",null,null,null,null,null,0,null,null,0,0,0,0,0,0,0,0,0,0,0,0,0,null,0,0,0,0,0,0,0,0,0,0,0,0,0,null,0,0,0,0,0,0,0,0,0,0,0,0,0,null,0,0,0,0,0,0,0,0,0,0,0,0,null,"No","No",0,0,0,null,null,null,0,0,0,0,0,null,null,null,null,null,null,null,"null","null",0,0,null,0,0,0,0,0,0,0,0,0,0,0,0,"null","null",0,0]
[null,null,null,null,"","","2019-04-01",null,null,null,null,null,0,null,null,0,0,0,0,0,0,0,0,0,0,0,0,0,null,0,0,0,0,0,0,0,0,0,0,0,0,0,null,0,0,0,0,0,0,0,0,0,0,0,0,0,null,0,0,0,0,0,0,0,0,0,0,0,0,null,"No","No",0,0,0,null,null,null,0,0,0,0,0,null,null,null,null,null,null,null,"null","null",0,0,null,0,0,0,0,0,0,0,0,0,0,0,0,"null","null",0,0]
[null,null,null,null,"","","2019-04-01",null,null,null,null,null,0,null,null,0,0,0,0,0,0,0,0,0,0,0,0,0,null,0,0,0,0,0,0,0,0,0,0,0,0,0,null,0,0,0,0,0,0,0,0,0,0,0,0,0,null,0,0,0,0,0,0,0,0,0,0,0,0,null,"No","No",0,0,0,null,null,null,0,0,0,0,0,null,null,null,null,null,null,null,"null","null",0,0,null,0,0,0,0,0,0,0,0,0,0,0,0,"null","null",0,0]
[null,null,null,null,"","","2019-04-01",null,null,null,null,null,0,null,null,0,0,0,0,0,0,0,0,0,0,0,0,0,null,0,0,0,0,0,0,0,0,0,0,0,0,0,null,0,0,0,0,0,0,0,0,0,0,0,0,0,null,0,0,0,0,0,0,0,0,0,0,0,0,null,"No","No",0,0,0,null,null,null,0,0,0,0,0,null,null,null,null,null,null,null,"null","null",0,0,null,0,0,0,0,0,0,0,0,0,0,0,0,"null","null",0,0]
[null,null,null,null,"","","2019-04-01",null,null,null,null,null,0,null,null,0,0,0,0,0,0,0,0,0,0,0,0,0,null,0,0,0,0,0,0,0,0,0,0,0,0,0,null,0,0,0,0,0,0,0,0,0,0,0,0,0,null,0,0,0,0,0,0,0,0,0,0,0,0,null,"No","No",0,0,0,null,null,null,0,0,0,0,0,null,null,null,null,null,null,null,"null","null",0,0,null,0,0,0,0,0,0,0,0,0,0,0,0,"null","null",0,0]
[null,null,null,null,"","","2019-04-01",null,null,null,null,null,0,null,null,0,0,0,0,0,0,0,0,0,0,0,0,0,null,0,0,0,0,0,0,0,0,0,0,0,0,0,null,0,0,0,0,0,0,0,0,0,0,0,0,0,null,0,0,0,0,0,0,0,0,0,0,0,0,null,"No","No",0,0,0,null,null,null,0,0,0,0,0,null,null,null,null,null,null,null,"null","null",0,0,null,0,0,0,0,0,0,0,0,0,0,0,0,"null","null",0,0]
[null,null,null,null,"","","2019-04-01",null,null,null,null,null,0,null,null,0,0,0,0,0,0,0,0,0,0,0,0,0,null,0,0,0,0,0,0,0,0,0,0,0,0,0,null,0,0,0,0,0,0,0,0,0,0,0,0,0,null,0,0,0,0,0,0,0,0,0,0,0,0,null,"No","No",0,0,0,null,null,null,0,0,0,0,0,null,null,null,null,null,null,null,"null","null",0,0,null,0,0,0,0,0,0,0,0,0,0,0,0,"null","null",0,0]
[null,null,null,null,"","","2019-04-01",null,null,null,null,null,0,null,null,0,0,0,0,0,0,0,0,0,0,0,0,0,null,0,0,0,0,0,0,0,0,0,0,0,0,0,null,0,0,0,0,0,0,0,0,0,0,0,0,0,null,0,0,0,0,0,0,0,0,0,0,0,0,null,"No","No",0,0,0,null,null,null,0,0,0,0,0,null,null,null,null,null,null,null,"null","null",0,0,null,0,0,0,0,0,0,0,0,0,0,0,0,"null","null",0,0]
[null,null,null,null,"","","2019-04-01",null,null,null,null,null,0,null,null,0,0,0,0,0,0,0,0,0,0,0,0,0,null,0,0,0,0,0,0,0,0,0,0,0,0,0,null,0,0,0,0,0,0,0,0,0,0,0,0,0,null,0,0,0,0,0,0,0,0,0,0,0,0,null,"No","No",0,0,0,null,null,null,0,0,0,0,0,null,null,null,null,null,null,null,"null","null",0,0,null,0,0,0,0,0,0,0,0,0,0,0,0,"null","null",0,0]
[null,null,null,null,"","","2019-04-01",null,null,null,null,null,0,null,null,0,0,0,0,0,0,0,0,0,0,0,0,0,null,0,0,0,0,0,0,0,0,0,0,0,0,0,null,0,0,0,0,0,0,0,0,0,0,0,0,0,null,0,0,0,0,0,0,0,0,0,0,0,0,null,"No","No",0,0,0,null,null,null,0,0,0,0,0,null,null,null,null,null,null,null,"null","null",0,0,null,0,0,0,0,0,0,0,0,0,0,0,0,"null","null",0,0]
[null,null,null,null,"","","2019-04-01",null,null,null,null,null,0,null,null,0,0,0,0,0,0,0,0,0,0,0,0,0,null,0,0,0,0,0,0,0,0,0,0,0,0,0,null,0,0,0,0,0,0,0,0,0,0,0,0,0,null,0,0,0,0,0,0,0,0,0,0,0,0,null,"No","No",0,0,0,null,null,null,0,0,0,0,0,null,null,null,null,null,null,null,"null","null",0,0,null,0,0,0,0,0,0,0,0,0,0,0,0,"null","null",0,0]
[null,null,null,null,"","","2019-04-01",null,null,null,null,null,0,null,null,0,0,0,0,0,0,0,0,0,0,0,0,0,null,0,0,0,0,0,0,0,0,0,0,0,0,0,null,0,0,0,0,0,0,0,0,0,0,0,0,0,null,0,0,0,0,0,0,0,0,0,0,0,0,null,"No","No",0,0,0,null,null,null,0,0,0,0,0,null,null,null,null,null,null,null,"null","null",0,0,null,0,0,0,0,0,0,0,0,0,0,0,0,"null","null",0,0]
[null,null,null,null,"","","2019-04-01",null,null,null,null,null,0,null,null,0,0,0,0,0,0,0,0,0,0,0,0,0,null,0,0,0,0,0,0,0,0,0,0,0,0,0,null,0,0,0,0,0,0,0,0,0,0,0,0,0,null,0,0,0,0,0,0,0,0,0,0,0,0,null,"No","No",0,0,0,null,null,null,0,0,0,0,0,null,null,null,null,null,null,null,"null","null",0,0,null,0,0,0,0,0,0,0,0,0,0,0,0,"null","null",0,0]
[null,null,null,null,"","","2019-04-01",null,null,null,null,null,0,null,null,0,0,0,0,0,0,0,0,0,0,0,0,0,null,0,0,0,0,0,0,0,0,0,0,0,0,0,null,0,0,0,0,0,0,0,0,0,0,0,0,0,null,0,0,0,0,0,0,0,0,0,0,0,0,null,"No","No",0,0,0,null,null,null,0,0,0,0,0,null,null,null,null,null,null,null,"null","null",0,0,null,0,0,0,0,0,0,0,0,0,0,0,0,"null","null",0,0]
[null,null,null,null,"","","2019-04-01",null,null,null,null,null,0,null,null,0,0,0,0,0,0,0,0,0,0,0,0,0,null,0,0,0,0,0,0,0,0,0,0,0,0,0,null,0,0,0,0,0,0,0,0,0,0,0,0,0,null,0,0,0,0,0,0,0,0,0,0,0,0,null,"No","No",0,0,0,null,null,null,0,0,0,0,0,null,null,null,null,null,null,null,"null","null",0,0,null,0,0,0,0,0,0,0,0,0,0,0,0,"null","null",0,0]
[null,null,null,null,"","","2019-04-01",null,null,null,null,null,0,null,null,0,0,0,0,0,0,0,0,0,0,0,0,0,null,0,0,0,0,0,0,0,0,0,0,0,0,0,null,0,0,0,0,0,0,0,0,0,0,0,0,0,null,0,0,0,0,0,0,0,0,0,0,0,0,null,"No","No",0,0,0,null,null,null,0,0,0,0,0,null,null,null,null,null,null,null,"null","null",0,0,null,0,0,0,0,0,0,0,0,0,0,0,0,"null","null",0,0]
[null,null,null,null,"","","2019-04-01",null,null,null,null,null,0,null,null,0,0,0,0,0,0,0,0,0,0,0,0,0,null,0,0,0,0,0,0,0,0,0,0,0,0,0,null,0,0,0,0,0,0,0,0,0,0,0,0,0,null,0,0,0,0,0,0,0,0,0,0,0,0,null,"No","No",0,0,0,null,null,null,0,0,0,0,0,null,null,null,null,null,null,null,"null","null",0,0,null,0,0,0,0,0,0,0,0,0,0,0,0,"null","null",0,0]
[null,null,null,null,"","","2019-04-01",null,null,null,null,null,0,null,null,0,0,0,0,0,0,0,0,0,0,0,0,0,null,0,0,0,0,0,0,0,0,0,0,0,0,0,null,0,0,0,0,0,0,0,0,0,0,0,0,0,null,0,0,0,0,0,0,0,0,0,0,0,0,null,"No","No",0,0,0,null,null,null,0,0,0,0,0,null,null,null,null,null,null,null,"null","null",0,0,null,0,0,0,0,0,0,0,0,0,0,0,0,"null","null",0,0]
[null,null,null,null,"","","2019-04-01",null,null,null,null,null,0,null,null,0,0,0,0,0,0,0,0,0,0,0,0,0,null,0,0,0,0,0,0,0,0,0,0,0,0,0,null,0,0,0,0,0,0,0,0,0,0,0,0,0,null,0,0,0,0,0,0,0,0,0,0,0,0,null,"No","No",0,0,0,null,null,null,0,0,0,0,0,null,null,null,null,null,null,null,"null","null",0,0,null,0,0,0,0,0,0,0,0,0,0,0,0,"null","null",0,0]
[null,null,null,null,"","","2019-04-01",null,null,null,null,null,0,null,null,0,0,0,0,0,0,0,0,0,0,0,0,{"$f":"SUM(P48:AA48)","v":0},null,0,0,0,0,0,0,0,0,0,0,0,0,{"$f":"SUM(AD48:AO48)","v":0},null,0,0,0,0,0,0,0,0,0,0,0,0,{"$f":"SUM(AR48:BC48)","v":0},null,0,0,0,0,0,0,0,0,0,0,0,0,null,"No","No",0,0,0,null,null,null,0,0,0,0,0,null,null,null,null,null,null,null,"null","null",0,0,null,0,0,0,0,0,0,0,0,0,0,0,0,"null","null",0,0]
[null,null,null,null,{"$f":"IF(D49=\"\",\"\",IF(SUM(DATEDIF(D49,DATE(YEAR($E$14)+(MONTH($E$14)>8),8,31),\"Y\")-5)=0,\"R\",IF(SUM(DATEDIF(D49,DATE(YEAR($E$14)+(MONTH($E$14)>8),8,31),\"Y\")-5)<0,\"\",DATEDIF(D49,DATE(YEAR($E$14)+(MONTH($E$14)>8),8,31),\"Y\")-5)))","v":""},"","2019-04-01",null,null,null,null,null,0,null,null,0,0,0,0,0,0,0,0,0,0,0,0,0,null,{"$f":"IF(AND(P49>0,$D49>DATE(2002,8,31)),sentopup/12,0)","v":0},{"$f":"IF(AND(Q49>0,$D49>DATE(2002,8,31)),sentopup/12,0)","v":0},{"$f":"IF(AND(R49>0,$D49>DATE(2002,8,31)),sentopup/12,0)","v":0},{"$f":"IF(AND(S49>0,$D49>DATE(2002,8,31)),sentopup/12,0)","v":0},{"$f":"IF(AND(T49>0,$D49>DATE(2002,8,31)),sentopup/12,0)","v":0},{"$f":"IF(AND(U49>0,$D49>DATE(2003,8,1)),sentopup/12,0)","v":0},{"$f":"IF(AND(V49>0,$D49>DATE(2003,8,1)),sentopup/12,0)","v":0},{"$f":"IF(AND(W49>0,$D49>DATE(2003,8,1)),sentopup/12,0)","v":0},{"$f":"IF(AND(X49>0,$D49>DATE(2003,8,1)),sentopup/12,0)","v":0},{"$f":"IF(AND(Y49>0,$D49>DATE(2003,8,1)),sentopup/12,0)","v":0},{"$f":"IF(AND(Z49>0,$D49>DATE(2003,8,1)),sentopup/12,0)","v":0},{"$f":"IF(AND(AA49>0,$D49>DATE(2003,8,1)),sentopup/12,0)","v":0},0,null,0,0,0,0,0,0,0,0,0,0,0,0,0,null,0,0,0,0,0,0,0,0,0,0,0,0,null,"No","No",{"$f":"IFERROR(IF(BS49=\"Yes\",L49*SUM(CA49:CE49),0),\"\")","v":0},{"$f":"SUM(sentopup/12)*CO49","v":0},0,null,null,null,0,0,0,0,0,null,null,null,null,null,null,null,{"$f":"IF(AND(D49>1,D49<DATE(2002,9,1)),\"post\",IF(AND(D49>1,D49>DATE(2002,8,31)),\"pre\",\"null\"))","v":"null"},{"$f":"IF(AND(D49>1,D49<DATE(2003,9,1)),\"post\",IF(AND(D49>1,D49>DATE(2003,8,31)),\"pre\",\"null\"))","v":"null"},0,0,null,0,0,0,0,0,0,0,0,0,0,0,0,{"$f":"IF(AND(D49>1,D49<DATE(2003,9,1)),\"post\",IF(AND(D49>1,D49>DATE(2003,8,31)),\"pre\",\"null\"))","v":"null"},{"$f":"IF(AND(D49>1,D49<DATE(2004,9,1)),\"post\",IF(AND(D49>1,D49>DATE(2004,8,31)),\"pre\",\"null\"))","v":"null"},0,0]
[null,null,null,null,"","","2019-04-01",null,null,null,null,null,0,null,null,0,0,0,0,0,0,0,0,0,0,0,0,0,null,0,0,0,0,0,0,0,0,0,0,0,0,0,null,0,0,0,0,0,0,0,0,0,0,0,0,0,null,0,0,0,0,0,0,0,0,0,0,0,0,null,"No","No",0,0,0,null,null,null,0,0,0,0,0,null,null,null,null,null,null,null,"null","null",0,0,null,0,0,0,0,0,0,0,0,0,0,0,0,"null","null",0,0]
[null,null,null,null,"","","2019-04-01",null,null,null,null,null,0,null,null,0,0,0,0,0,0,0,0,0,0,0,0,0,null,0,0,0,0,0,0,0,0,0,0,0,0,0,null,0,0,0,0,0,0,0,0,0,0,0,0,0,null,0,0,0,0,0,0,0,0,0,0,0,0,null,"No","No",0,0,0,null,null,null,0,0,0,0,0,null,null,null,null,null,null,null,"null","null",0,0,null,0,0,0,0,0,0,0,0,0,0,0,0,"null","null",0,0]
[null,null,null,null,"","","2019-04-01",null,null,null,null,null,0,null,null,0,0,0,0,0,0,0,0,0,0,0,0,0,null,0,0,0,0,0,0,0,0,0,0,0,0,0,null,0,0,0,0,0,0,0,0,0,0,0,0,0,null,0,0,0,0,0,0,0,0,0,0,0,0,null,"No","No",0,0,0,null,null,null,0,0,0,0,0,null,null,null,null,null,null,null,"null","null",0,0,null,0,0,0,0,0,0,0,0,0,0,0,0,"null","null",0,0]
[null,null,null,null,"","","2019-04-01",null,null,null,null,null,0,null,null,0,0,0,0,0,0,0,0,0,0,0,0,0,null,0,0,0,0,0,0,0,0,0,0,0,0,0,null,0,0,0,0,0,0,0,0,0,0,0,0,0,null,{"$f":"IF(P53>0,500-AD53-AR53,0)","v":0},0,0,0,0,0,0,0,0,0,0,0,null,"No","No",0,0,0,null,null,null,0,0,0,0,0,null,null,null,null,null,null,null,"null","null",0,0,null,0,0,0,0,0,0,0,0,0,0,0,0,"null","null",0,0]
[null,null,null,null,"","","2019-04-01",null,null,null,null,null,0,null,null,0,0,0,0,0,0,0,0,0,0,0,0,0,null,0,0,0,0,0,0,0,0,0,0,0,0,0,null,0,0,0,0,0,0,0,0,0,0,0,0,0,null,0,0,0,0,0,0,0,0,0,0,0,0,null,"No","No",0,0,0,null,null,null,0,0,0,0,0,null,null,null,null,null,null,null,"null","null",0,0,null,0,0,0,0,0,0,0,0,0,0,0,0,"null","null",0,0]
[null,null,null,null,"","","2019-04-01",null,null,null,null,null,0,null,null,0,0,0,0,0,0,0,0,0,0,0,0,0,null,0,0,0,0,0,0,0,0,0,0,0,0,0,null,0,0,0,0,0,0,0,0,0,0,0,0,0,null,0,0,0,0,0,0,0,0,0,0,0,0,null,"No","No",0,0,0,null,null,null,0,0,0,0,0,null,null,null,null,null,null,null,"null","null",0,0,null,0,0,0,0,0,0,0,0,0,0,0,0,"null","null",0,0]
[null,null,null,null,"","","2019-04-01",null,null,null,null,null,0,null,null,0,0,0,0,0,0,0,0,0,0,0,0,0,null,0,0,0,0,0,0,0,0,0,0,0,0,0,null,0,0,0,0,0,0,0,0,0,0,0,0,0,null,0,0,0,0,0,0,0,0,0,0,0,0,null,"No","No",0,0,0,null,null,null,0,0,0,0,0,null,null,null,null,null,null,null,"null","null",0,0,null,0,0,0,0,0,0,0,0,0,0,0,0,"null","null",0,0]
[null,null,null,null,"","","2019-04-01",null,null,null,null,null,0,null,null,0,0,0,0,0,0,0,0,0,0,0,0,0,null,0,0,0,0,0,0,0,0,0,0,0,0,0,null,0,0,0,0,0,0,0,0,0,0,0,0,0,null,0,0,0,0,0,0,0,0,0,0,0,0,null,"No","No",0,0,0,null,null,null,0,0,0,0,0,null,null,null,null,null,null,null,"null","null",0,0,null,0,0,0,0,0,0,0,0,0,0,0,0,"null","null",0,0]
[null,null,null,null,"","","2019-04-01",null,null,null,null,null,0,null,null,0,0,0,0,0,0,0,0,0,0,0,0,0,null,0,0,0,0,0,0,0,0,0,0,0,0,0,null,0,0,0,0,0,0,0,0,0,0,0,0,0,null,0,0,0,0,0,0,0,0,0,0,0,0,null,"No","No",0,0,0,null,null,null,0,0,0,0,0,null,null,null,null,null,null,null,"null","null",0,0,null,0,0,0,0,0,0,0,0,0,0,0,0,"null","null",0,0]
[null,null,null,null,"","","2019-04-01",null,null,null,null,null,0,null,null,0,0,0,0,0,0,0,0,0,0,0,0,0,null,0,0,0,0,0,0,0,0,0,0,0,0,0,null,0,0,0,0,0,0,0,0,0,0,0,0,0,null,0,0,0,0,0,0,0,0,0,0,0,0,null,"No","No",0,0,0,null,null,null,0,0,0,0,0,null,null,null,null,null,null,null,"null","null",0,0,null,0,0,0,0,0,0,0,0,0,0,0,0,"null","null",0,0]
[null,null,null,null,"","","2019-04-01",null,null,null,null,null,0,null,null,0,0,0,0,0,0,0,0,0,0,0,0,0,null,0,0,0,0,0,0,0,0,0,0,0,0,0,null,0,0,0,0,0,0,0,0,0,0,0,0,0,null,0,0,0,0,0,0,0,0,0,0,0,0,null,"No","No",0,0,0,null,null,null,0,0,0,0,0,null,null,null,null,null,null,null,"null","null",0,0,null,0,0,0,0,0,0,0,0,0,0,0,0,"null","null",0,0]
[null,null,null,null,"","","2019-04-01",null,null,null,null,null,0,null,null,0,0,0,0,0,0,0,0,0,0,0,0,0,null,0,0,0,0,0,0,0,0,0,0,0,0,0,null,0,0,0,0,0,0,0,0,0,0,0,0,0,null,0,0,0,0,0,0,0,0,0,0,0,0,null,"No","No",0,0,0,null,null,null,0,0,0,0,0,null,null,null,null,null,null,null,"null","null",0,0,null,0,0,0,0,0,0,0,0,0,0,0,0,"null","null",0,0]
[null,null,null,null,"","","2019-04-01",null,null,null,null,null,0,null,null,0,0,0,0,0,0,0,0,0,0,0,0,0,null,0,0,0,0,0,0,0,0,0,0,0,0,0,null,0,0,0,0,0,0,0,0,0,0,0,0,0,null,0,0,0,0,0,0,0,0,0,0,0,0,null,"No","No",0,0,0,null,null,null,0,0,0,0,0,null,null,null,null,null,null,null,"null","null",0,0,null,0,0,0,0,0,0,0,0,0,0,0,0,"null","null",0,0]
[null,null,null,null,"","","2019-04-01",null,null,null,null,null,0,null,null,0,0,0,0,0,0,0,0,0,0,0,0,0,null,0,0,0,0,0,0,0,0,0,0,0,0,0,null,0,0,0,0,0,0,0,0,0,0,0,0,0,null,0,0,0,0,0,0,0,0,0,0,0,0,null,"No","No",0,0,0,null,null,null,0,0,0,0,0,null,null,null,null,null,null,null,"null","null",0,0,null,0,0,0,0,0,0,0,0,0,0,0,0,"null","null",0,0]
[null,null,null,null,"","","2019-04-01",null,null,null,null,null,0,null,null,0,0,0,0,0,0,0,0,0,0,0,0,0,null,0,0,0,0,0,0,0,0,0,0,0,0,0,null,0,0,0,0,0,0,0,0,0,0,0,0,0,null,0,0,0,0,0,0,0,0,0,0,0,0,null,"No","No",0,0,0,null,null,null,0,0,0,0,0,null,null,null,null,null,null,null,"null","null",0,0,null,0,0,0,0,0,0,0,0,0,0,0,0,"null","null",0,0]
[null,null,null,null,"","","2019-04-01",null,null,null,null,null,0,null,null,0,0,0,0,0,0,0,0,0,0,0,0,0,null,0,0,0,0,0,0,0,0,0,0,0,0,0,null,0,0,0,0,0,0,0,0,0,0,0,0,0,null,0,0,0,0,0,0,0,0,0,0,0,0,null,"No","No",0,0,0,null,null,null,0,0,0,0,0,null,null,null,null,null,null,null,"null","null",0,0,null,0,0,0,0,0,0,0,0,0,0,0,0,"null","null",0,0]
[null,null,null,null,"","","2019-04-01",null,null,null,null,null,0,null,null,0,0,0,0,0,0,0,0,0,0,0,0,0,null,0,0,0,0,0,0,0,0,0,0,0,0,0,null,0,0,0,0,0,0,0,0,0,0,0,0,0,null,0,0,0,0,0,0,0,0,0,0,0,0,null,"No","No",0,0,0,null,null,null,0,0,0,0,0,null,null,null,null,null,null,null,"null","null",0,0,null,0,0,0,0,0,0,0,0,0,0,0,0,"null","null",0,0]
[null,null,null,null,"","","2019-04-01",null,null,null,null,null,0,null,null,0,0,0,0,0,0,0,0,0,0,0,0,0,null,0,0,0,0,0,0,0,0,0,0,0,0,0,null,0,0,0,0,0,0,0,0,0,0,0,0,0,null,0,0,0,0,0,0,0,0,0,0,0,0,null,"No","No",0,0,0,null,null,null,0,0,0,0,0,null,null,null,null,null,null,null,"null","null",0,0,null,0,0,0,0,0,0,0,0,0,0,0,0,"null","null",0,0]
[null,null,null,null,"","","2019-04-01",null,null,null,null,null,0,null,null,0,0,0,0,0,0,0,0,0,0,0,0,0,null,0,0,0,0,0,0,0,0,0,0,0,0,0,null,0,0,0,0,0,0,0,0,0,0,0,0,0,null,0,0,0,0,0,0,0,0,0,0,0,0,null,"No","No",0,0,0,null,null,null,0,0,0,0,0,null,null,null,null,null,null,null,"null","null",0,0,null,0,0,0,0,0,0,0,0,0,0,0,0,"null","null",0,0]
[null,null,null,null,"","","2019-04-01",null,null,null,null,null,0,null,null,0,0,0,0,0,0,0,0,0,0,0,0,0,null,0,0,0,0,0,0,0,0,0,0,0,0,0,null,0,0,0,0,0,0,0,0,0,0,0,0,0,null,0,0,0,0,0,0,0,0,0,0,0,0,null,"No","No",0,0,0,null,null,null,0,0,0,0,0,null,null,null,null,null,null,null,"null","null",0,0,null,0,0,0,0,0,0,0,0,0,0,0,0,"null","null",0,0]
[null,null,null,null,"","","2019-04-01",null,null,null,null,null,0,null,null,0,0,0,0,0,0,0,0,0,0,0,0,0,null,0,0,0,0,0,0,0,0,0,0,0,0,0,null,0,0,0,0,0,0,0,0,0,0,0,0,0,null,0,0,0,0,0,0,0,0,0,0,0,0,null,"No","No",0,0,0,null,null,null,0,0,0,0,0,null,null,null,null,null,null,null,"null","null",0,0,null,0,0,0,0,0,0,0,0,0,0,0,0,"null","null",0,0]
[null,null,null,null,"","","2019-04-01",null,null,null,null,null,0,null,null,0,0,0,0,0,0,0,0,0,0,0,0,0,null,0,0,0,0,0,0,0,0,0,0,0,0,0,null,0,0,0,0,0,0,0,0,0,0,0,0,0,null,0,0,0,0,0,0,0,0,0,0,0,0,null,"No","No",0,0,0,null,null,null,0,0,0,0,0,null,null,null,null,null,null,null,"null","null",0,0,null,0,0,0,0,0,0,0,0,0,0,0,0,"null","null",0,0]
[null,null,null,null,"","","2019-04-01",null,null,null,null,null,0,null,null,0,0,0,0,0,0,0,0,0,0,0,0,0,null,0,0,0,0,0,0,0,0,0,0,0,0,0,null,0,0,0,0,0,0,0,0,0,0,0,0,0,null,0,0,0,0,0,0,0,0,0,0,0,0,null,"No","No",0,0,0,null,null,null,0,0,0,0,0,null,null,null,null,null,null,null,"null","null",0,0,null,0,0,0,0,0,0,0,0,0,0,0,0,"null","null",0,0]
[null,null,null,null,"","","2019-04-01",null,null,null,null,null,0,null,null,0,0,0,0,0,0,0,0,0,0,0,0,0,null,0,0,0,0,0,0,0,0,0,0,0,0,0,null,0,0,0,0,0,0,0,0,0,0,0,0,0,null,0,0,0,0,0,0,0,0,0,0,0,0,null,"No","No",0,0,0,null,null,null,0,0,0,0,0,null,null,null,null,null,null,null,"null","null",0,0,null,0,0,0,0,0,0,0,0,0,0,0,0,"null","null",0,0]
[null,null,null,null,"","","2019-04-01",null,null,null,null,null,0,null,null,0,0,0,0,0,0,0,0,0,0,0,0,0,null,0,0,0,0,0,0,0,0,0,0,0,0,0,null,0,0,0,0,0,0,0,0,0,0,0,0,0,null,0,0,0,{"$f":"IF(S74>0,500-AG74-AU74,0)","v":0},0,0,0,0,0,0,0,0,null,"No","No",0,0,0,null,null,null,0,0,0,0,0,null,null,null,null,null,null,null,"null","null",0,0,null,0,0,0,0,0,0,0,0,0,0,0,0,"null","null",0,0]
[null,null,null,null,"","","2019-04-01",null,null,null,null,null,0,null,null,0,0,0,0,0,0,0,0,0,0,0,0,0,null,0,0,0,0,0,0,0,0,0,0,0,0,0,null,0,0,0,0,0,0,0,0,0,0,0,0,0,null,{"$f":"IF(P75>0,500-AD75-AR75,0)","v":0},0,0,0,0,0,0,0,0,0,0,0,null,"No","No",0,0,0,null,null,null,0,0,0,0,0,null,null,null,null,null,null,null,"null","null",0,0,null,0,0,0,0,0,0,0,0,0,0,0,0,"null","null",0,0]
[null,null,null,null,"","","2019-04-01",null,null,null,null,null,0,null,null,0,0,0,0,0,0,0,0,0,0,0,0,0,null,0,0,0,0,0,0,0,0,0,0,0,0,0,null,0,0,0,0,0,0,0,0,0,0,0,0,0,null,0,0,0,0,0,0,0,0,0,0,0,0,null,"No","No",0,0,0,null,null,null,0,0,0,0,0,null,null,null,null,null,null,null,"null","null",0,0,null,0,0,0,0,0,0,0,0,0,0,0,0,"null","null",0,0]
[null,null,null,null,"","","2019-04-01",null,null,null,null,null,0,null,null,0,0,0,0,0,0,0,0,0,0,0,0,0,null,0,0,0,0,0,0,0,0,0,0,0,0,0,null,0,0,0,0,0,0,0,0,0,0,0,0,0,null,0,0,0,0,0,0,0,0,0,0,0,0,null,"No","No",0,0,0,null,null,null,0,0,0,0,0,null,null,null,null,null,null,null,"null","null",0,0,null,0,0,0,0,0,0,0,0,0,0,0,0,"null","null",0,0]
[null,null,null,null,"","","2019-04-01",null,null,null,null,null,0,null,null,0,0,0,0,0,0,0,0,0,0,0,0,0,null,0,0,0,0,0,0,0,0,0,0,0,0,0,null,0,0,0,0,0,0,0,0,0,0,0,0,0,null,0,0,0,0,0,0,0,0,0,0,0,0,null,"No","No",0,0,0,null,null,null,0,0,0,0,0,null,null,null,null,null,null,null,"null","null",0,0,null,0,0,0,0,0,0,0,0,0,0,0,0,"null","null",0,0]
[null,null,null,null,"","","2019-04-01",null,null,null,null,null,0,null,null,0,0,0,0,0,0,0,0,0,0,0,0,0,null,0,0,0,0,0,0,0,0,0,0,0,0,0,null,0,0,0,0,0,0,0,0,0,0,0,0,0,null,0,0,0,0,0,0,0,0,0,0,0,0,null,"No","No",0,0,0,null,null,null,0,0,0,0,0,null,null,null,null,null,null,null,"null","null",0,0,null,0,0,0,0,0,0,0,0,0,0,0,0,"null","null",0,0]
[null,null,null,null,"","","2019-04-01",null,null,null,null,null,0,null,null,0,0,0,0,0,0,0,0,0,0,0,0,0,null,0,0,0,0,0,0,0,0,0,0,0,0,0,null,0,0,0,0,0,0,0,0,0,0,0,0,0,null,0,0,0,0,0,0,0,0,0,0,0,0,null,"No","No",0,0,0,null,null,null,0,0,0,0,0,null,null,null,null,null,null,null,"null","null",0,0,null,0,0,0,0,0,0,0,0,0,0,0,0,"null","null",0,0]
[null,null,null,null,{"$f":"IF(D81=\"\",\"\",IF(SUM(DATEDIF(D81,DATE(YEAR($E$14)+(MONTH($E$14)>8),8,31),\"Y\")-5)=0,\"R\",IF(SUM(DATEDIF(D81,DATE(YEAR($E$14)+(MONTH($E$14)>8),8,31),\"Y\")-5)<0,\"\",DATEDIF(D81,DATE(YEAR($E$14)+(MONTH($E$14)>8),8,31),\"Y\")-5)))","v":""},{"$f":"IF(D81=\"\",\"\",IF(SUM(DATEDIF(D81,DATE(YEAR($F$14)+(MONTH($F$14)>8),8,31),\"Y\")-5)=0,\"R\",DATEDIF(D81,DATE(YEAR($F$14)+(MONTH($F$14)>8),8,31),\"Y\")-5))","v":""},"2019-04-01",null,null,null,null,null,0,null,null,0,0,0,0,0,0,0,0,0,0,0,0,0,null,0,0,0,0,0,0,0,0,0,0,0,0,0,null,0,0,0,0,0,0,0,0,0,0,0,0,0,null,0,0,0,0,0,0,0,0,0,0,0,0,null,"No","No",0,0,0,null,null,null,0,0,0,0,0,null,null,null,null,null,null,null,"null","null",0,0,null,0,0,0,0,0,0,0,0,0,0,0,0,"null","null",0,0]
[]
[null,null,null,null,null,null,null,null,null,null,null,null,{"$f":"SUM(M17:N81)","v":0},null,null,null,null,null,null,null,null,null,null,null,null,null,null,{"$f":"SUM(AB17:AB81)","v":0},null,null,null,null,null,null,null,null,null,null,null,null,null,{"$f":"SUM(AP17:AP81)","v":0},null,null,null,null,null,null,null,null,null,null,null,null,null,{"$f":"SUM(BD17:BD81)","v":0},null,null,null,null,null,null,null,null,null,null,null,null,null,null,null,null,{"$f":"SUM(BU17:BU82)","v":0},{"$f":"SUM(BV17:BV82)","v":0},{"$f":"SUM(BW17:BW82)","v":0}]
[null,null,null,null,null,null,null,null,null,null,null,null,null,null,null,null,null,null,null,null,null,null,null,null,null,null,null,null,null,null,null,null,null,null,null,null,null,null,null,null,"28% rule",{"$f":"AP12","v":0}]
[null,null,null,null,null,null,null,null,null,null,null,null,null,null,null,null,null,null,null,null,null,null,null,null,null,null,null,null,null,null,null,null,null,null,null,null,null,null,null,null,"Grand total",{"$f":"AP84+AP83","v":0},null,null,null,null,null,null,null,null,null,null,null,null,null,null,null,null,null,null,null,null,null,null,null,null,null,null,null,null,null,null,null,null,{"$f":"SUM(BU83:BW83)","v":0}]

{"sheet":"Specialist Resourced Provision","index":7,"n_rows":181,"n_cols":33,"rows_kept":181,"cut":false,"hidden":false,"merged":[[34,4,34,5],[33,1,34,1],[38,1,40,8],[61,3,62,3],[43,5,44,5],[61,4,62,4],[61,5,62,5],[61,6,62,6],[61,7,62,7],[43,6,44,6],[43,7,44,7],[5,2,5,8],[7,2,7,8],[11,1,12,7],[13,1,13,3],[33,4,33,5],[29,1,30,1],[15,4,15,5],[16,4,16,5],[17,4,17,5],[20,4,20,5],[21,4,21,5],[26,4,28,5],[20,2,21,2],[16,2,17,2],[29,4,29,5],[30,4,30,5]]}
[]
[null,null,null,null,null,null,null,{"$f":"dfenum","v":2009}]
[]
[]
[]
[null,null,{"$f":"academyname","v":"Northdown Primary School"}]
[]
[null,null,"High Needs funding in a Specialist Resourced Provision (SRP) - Place Plus "]
[]
[null,"2019/20 Place Funding",null,null,null,null,null,null,null,null,"2019/20 Element 3 Input (top-up funding)"]
[]
[null,null,null,null,null,null,null,null,null,null,"Pupils should only be recorded on this sheet where the School is named on the pupils Education Health Care Plan (EHCP)"]
[null,null,null,null,null,null,null,null,null,null,"SRP funding agreed with other local authorities for pupils they have placed should be entered on Budget Preparation"]
[null,"SRP funding information document (Click link)",null,null,null,null,null,null,null,null,"A designation must always be selected.  Apart from one school with two SRPs the designation will always be 1."]
[null,"Element 1"]
[null,null,null,null,"KCC Commissioned Places",null,"Places included in formula allocation",null,null,null,"Designation","Pupil Surname","Pupil Forename","D.O.B","Pre/Post 16\nSUMMER","Pre/Post 16 WINTER","Placement START Date","Placement END Date","Monthly Rate Apr-Aug","Monthly Rate Sep-Mar","April\n(March Pupils)","May\n(April Pupils)","June\n(May Pupils)","July\n(June Pupils)","August\n(July Pupils)","September\n(July Pupils)","October\n(September Pupils)","November\n(October Pupils)","December\n(November Pupils)","January\n(December Pupils)","February\n(January Pupils)","March\n(February Pupils)","Total For Pupil"]
[null,"Pre-16","Academic Year 2018/19",null,{"$f":"IFERROR(VLOOKUP(dfenum,Data!A:S,16,0),0)","v":0},null,{"$f":"IFERROR(VLOOKUP(dfenum,Data!A:X,20,0),0)","v":0},null,null,null,null,null,null,null,{"$f":"IF(N17=0,\"\",IF(N17<DATE(2002,9,1),\"Post-16\",\"Pre-16\"))","v":""},{"$f":"IF(N17=0,\"\",IF(N17<DATE(2003,9,1),\"Post-16\",\"Pre-16\"))","v":""},"2019-03-31","2020-03-31",{"$f":"IF(AND(K17=\"Designation 1\",O17=\"Pre-16\"),VLOOKUP(dfenum,data,12,0),\nIF(AND(K17=\"Designation 1\",O17=\"Post-16\"),VLOOKUP(dfenum,data,13,0),\nIF(AND(K17=\"Designation 2\",O17=\"Pre-16\"),VLOOKUP(dfenum,data,14,0),\nIF(AND(K17=\"Designation 1\",O17=\"Post-16\"),VLOOKUP(dfenum,data,15,0),0))))","v":0},{"$f":"IF(AND(K17=\"Designation 1\",P17=\"Pre-16\"),VLOOKUP(dfenum,data,12,0),\nIF(AND(K17=\"Designation 1\",P17=\"Post-16\"),VLOOKUP(dfenum,data,13,0),\nIF(AND(K17=\"Designation 2\",P17=\"Pre-16\"),VLOOKUP(dfenum,data,14,0),\nIF(AND(K17=\"Designation 2\",P17=\"Post-16\"),VLOOKUP(dfenum,data,15,0),0))))","v":0},{"$f":"IF(OR(Q17>DATE(2019,3,31),R17<DATE(2019,3,1)),0,S17)","v":0},{"$f":"IF(OR(Q17>DATE(2019,4,30),R17<DATE(2019,4,1)),0,S17)","v":0},{"$f":"IF(OR(Q17>DATE(2019,5,31),R17<DATE(2019,5,1)),0,S17)","v":0},{"$f":"IF(OR(Q17>DATE(2019,6,30),R17<DATE(2019,6,1)),0,S17)","v":0},{"$f":"IF(OR(Q17>DATE(2019,7,31),R17<DATE(2019,7,1)),0,S17)","v":0},{"$f":"IF(OR(Q17>DATE(2019,7,31),R17<DATE(2019,7,1)),0,S17)","v":0},{"$f":"IF(OR(Q17>DATE(2019,9,30),R17<DATE(2019,9,1)),0,T17)","v":0},{"$f":"IF(OR(Q17>DATE(2019,10,31),R17<DATE(2019,10,1)),0,T17)","v":0},{"$f":"IF(OR(Q17>DATE(2019,11,30),R17<DATE(2019,11,1)),0,T17)","v":0},{"$f":"IF(OR(Q17>DATE(2019,12,31),R17<DATE(2019,12,1)),0,T17)","v":0},{"$f":"IF(OR(Q17>DATE(2020,1,31),R17<DATE(2020,1,1)),0,T17)","v":0},{"$f":"IF(OR(Q17>DATE(2020,2,29),R17<DATE(2020,2,1)),0,T17)","v":0},{"$f":"SUM(U17:AF17)","v":0}]
[null,"Post-16",null,null,{"$f":"IFERROR(VLOOKUP(dfenum,Data!A:S,17,0),0)","v":0},null,null,null,null,null,null,null,null,null,{"$f":"IF(N18=0,\"\",IF(N18<DATE(2002,9,1),\"Post-16\",\"Pre-16\"))","v":""},{"$f":"IF(N18=0,\"\",IF(N18<DATE(2003,9,1),\"Post-16\",\"Pre-16\"))","v":""},"2019-03-31","2020-03-31",0,0,{"$f":"IF(OR(Q18>DATE(2019,3,31),R18<DATE(2019,3,1)),0,S18)","v":0},{"$f":"IF(OR(Q18>DATE(2019,4,30),R18<DATE(2019,4,1)),0,S18)","v":0},{"$f":"IF(OR(Q18>DATE(2019,5,31),R18<DATE(2019,5,1)),0,S18)","v":0},{"$f":"IF(OR(Q18>DATE(2019,6,30),R18<DATE(2019,6,1)),0,S18)","v":0},{"$f":"IF(OR(Q18>DATE(2019,7,31),R18<DATE(2019,7,1)),0,S18)","v":0},{"$f":"IF(OR(Q18>DATE(2019,7,31),R18<DATE(2019,7,1)),0,S18)","v":0},{"$f":"IF(OR(Q18>DATE(2019,9,30),R18<DATE(2019,9,1)),0,T18)","v":0},{"$f":"IF(OR(Q18>DATE(2019,10,31),R18<DATE(2019,10,1)),0,T18)","v":0},{"$f":"IF(OR(Q18>DATE(2019,11,30),R18<DATE(2019,11,1)),0,T18)","v":0},{"$f":"IF(OR(Q18>DATE(2019,12,31),R18<DATE(2019,12,1)),0,T18)","v":0},{"$f":"IF(OR(Q18>DATE(2020,1,31),R18<DATE(2020,1,1)),0,T18)","v":0},{"$f":"IF(OR(Q18>DATE(2020,2,29),R18<DATE(2020,2,1)),0,T18)","v":0},{"$f":"SUM(U18:AF18)","v":0}]
[null,null,null,null,null,null,null,null,null,null,null,null,null,null,"","","2019-03-31","2020-03-31",0,0,0,0,0,0,0,0,0,0,0,0,0,0,0]
[null,null,null,null,null,null,null,null,null,null,null,null,null,null,"","","2019-03-31","2020-03-31",0,0,0,0,0,0,0,0,0,0,0,0,0,0,0]
[null,"Pre-16","Academic Year 2019/20",null,{"$f":"IFERROR(VLOOKUP(dfenum,Data!A:S,18,0),0)","v":0},null,{"$f":"IFERROR(VLOOKUP(dfenum,Data!A:X,21,0),0)","v":0},null,null,null,null,null,null,null,"","","2019-03-31","2020-03-31",0,0,0,0,0,0,0,0,0,0,0,0,0,0,0]
[null,"Post-16",null,null,{"$f":"IFERROR(VLOOKUP(dfenum,Data!A:S,19,0),0)","v":0},null,null,null,null,null,null,null,null,null,"","","2019-03-31","2020-03-31",0,0,0,0,0,0,0,0,0,0,0,0,0,0,0]
[null,null,null,null,null,null,null,null,null,null,null,null,null,null,"","","2019-03-31","2020-03-31",0,0,0,0,0,0,0,0,0,0,0,0,0,0,0]
[null,null,null,null,null,null,null,null,null,null,null,null,null,null,"","","2019-03-31","2020-03-31",0,0,0,0,0,0,0,0,0,0,0,0,0,0,0]
[null,null,null,null,null,null,null,null,null,null,null,null,null,null,"","","2019-03-31","2020-03-31",0,0,0,0,0,0,0,0,0,0,0,0,0,0,0]
[null,null,null,null,null,null,null,null,null,null,null,null,null,null,"","","2019-03-31","2020-03-31",0,0,0,0,0,0,0,0,0,0,0,0,0,0,0]
[null,null,null,null,"KCC Commissioned Places",null,null,null,null,null,null,null,null,null,"","","2019-03-31","2020-03-31",0,0,0,0,0,0,0,0,0,0,0,0,0,0,0]
[null,"Element 2",null,null,null,null,null,null,null,null,null,null,null,null,"","","2019-03-31","2020-03-31",0,0,0,0,0,0,0,0,0,0,0,0,0,0,0]
[null,null,null,null,null,null,null,null,null,null,null,null,null,null,"","","2019-03-31","2020-03-31",0,0,0,0,0,0,0,0,0,0,0,0,0,0,0]
[null,"Pre-16","Apr to Aug",null,{"$f":"E17","v":0},null,null,null,null,null,null,null,null,null,"","","2019-03-31","2020-03-31",0,0,0,0,0,0,0,0,0,0,0,0,0,0,0]
[null,null,"Sep to Mar",null,{"$f":"E21","v":0},null,null,null,null,null,null,null,null,null,"","","2019-03-31","2020-03-31",0,0,0,0,0,0,0,0,0,0,0,0,0,0,0]
[null,null,null,null,null,null,null,null,null,null,null,null,null,null,"","","2019-03-31","2020-03-31",0,0,0,0,0,0,0,0,0,0,0,0,0,0,0]
[null,null,null,null,null,null,null,null,null,null,null,null,null,null,"","","2019-03-31","2020-03-31",0,0,0,0,0,0,0,0,0,0,0,0,0,0,0]
[null,"Post-16","Apr to Jul",null,{"$f":"IFERROR(VLOOKUP(dfenum,Data!A:S,17,0),0)","v":0},null,null,null,null,null,null,null,null,null,"","","2019-03-31","2020-03-31",0,0,0,0,0,0,0,0,0,0,0,0,0,0,0]
[null,null,"Aug to Mar",null,{"$f":"IFERROR(VLOOKUP(dfenum,Data!A:S,19,0),0)","v":0},null,null,null,null,null,null,null,null,null,"","","2019-03-31","2020-03-31",0,0,0,0,0,0,0,0,0,0,0,0,0,0,0]
[null,null,null,null,null,null,null,null,{"$f":"H36+H23","v":0},null,null,null,null,null,"","","2019-03-31","2020-03-31",0,0,0,0,0,0,0,0,0,0,0,0,0,0,0]
[null,null,null,null,null,null,null,null,null,null,null,null,null,null,"","","2019-03-31","2020-03-31",0,0,0,0,0,0,0,0,0,0,0,0,0,0,0]
[null,"Excess Place Funding (Elements 1 & 2)",null,null,null,null,null,null,null,null,null,null,null,null,"","","2019-03-31","2020-03-31",0,0,0,0,0,0,0,0,0,0,0,0,0,0,0]
[null,"Place funding is guaranteed for your commissioned number of places, no place funding will be deducted. Excess Place funding is only relevant where you exceed your commissioned places and will only ever be a positive amount.",null,null,null,null,null,null,null,null,null,null,null,null,"","","2019-03-31","2020-03-31",0,0,0,0,0,0,0,0,0,0,0,0,0,0,0]
[null,null,null,null,null,null,null,null,null,null,null,null,null,null,"","","2019-03-31","2020-03-31",0,0,0,0,0,0,0,0,0,0,0,0,0,0,0]
[null,null,null,null,null,null,null,null,null,null,null,null,null,null,"","","2019-03-31","2020-03-31",0,0,0,0,0,0,0,0,0,0,0,0,0,0,0]
[null,null,null,null,null,null,null,null,null,null,null,null,null,null,"","","2019-03-31","2020-03-31",0,0,0,0,0,0,0,0,0,0,0,0,0,0,0]
[null,"Excess Element 1",null,null,null,null,null,null,null,null,null,null,null,null,"","","2019-03-31","2020-03-31",0,0,0,0,0,0,0,0,0,0,0,0,0,0,0]
[null,null,null,null,null,"Pre-16 Excess Pupil Numbers","Pre-16 Funding","Total Funding",null,null,null,null,null,null,"","","2019-03-31","2020-03-31",0,0,0,0,0,0,0,0,0,0,0,0,0,0,0]
[null,null,null,null,null,null,null,null,null,null,null,null,null,null,"","","2019-03-31","2020-03-31",0,0,0,0,0,0,0,0,0,0,0,0,0,0,0]
[null,"April",null,null,null,{"$f":"U170-MAX($E$17,$G$17)","v":0},{"$f":"IF(F46=0,0,$S$180)","v":0},{"$f":"IF((F46*G46)<0,0,(F46*G46))","v":0},null,null,null,null,null,null,"","","2019-03-31","2020-03-31",0,0,0,0,0,0,0,0,0,0,0,0,0,0,0]
[null,"May",null,null,null,{"$f":"V170-MAX($E$17,$G$17)","v":0},{"$f":"IF(F47=0,0,$S$180)","v":0},{"$f":"IF((F47*G47)<0,0,(F47*G47))","v":0},null,null,null,null,null,null,"","","2019-03-31","2020-03-31",0,0,0,0,0,0,0,0,0,0,0,0,0,0,0]
[null,"June",null,null,null,{"$f":"W170-MAX($E$17,$G$17)","v":0},0,0,null,null,null,null,null,null,"","","2019-03-31","2020-03-31",0,0,0,0,0,0,0,0,0,0,0,0,0,0,0]
[null,"July",null,null,null,{"$f":"X170-MAX($E$17,$G$17)","v":0},0,0,null,null,null,null,null,null,"","","2019-03-31","2020-03-31",{"$f":"IF(AND(K49=\"Designation 1\",O49=\"Pre-16\"),VLOOKUP(dfenum,data,12,0),\nIF(AND(K49=\"Designation 1\",O49=\"Post-16\"),VLOOKUP(dfenum,data,13,0),\nIF(AND(K49=\"Designation 2\",O49=\"Pre-16\"),VLOOKUP(dfenum,data,14,0),\nIF(AND(K49=\"Designation 1\",O49=\"Post-16\"),VLOOKUP(dfenum,data,15,0),0))))","v":0},{"$f":"IF(AND(K49=\"Designation 1\",P49=\"Pre-16\"),VLOOKUP(dfenum,data,12,0),\nIF(AND(K49=\"Designation 1\",P49=\"Post-16\"),VLOOKUP(dfenum,data,13,0),\nIF(AND(K49=\"Designation 2\",P49=\"Pre-16\"),VLOOKUP(dfenum,data,14,0),\nIF(AND(K49=\"Designation 2\",P49=\"Post-16\"),VLOOKUP(dfenum,data,15,0),0))))","v":0},0,0,0,0,0,0,0,0,0,0,0,0,{"$f":"SUM(U49:AF49)","v":0}]
[null,"August",null,null,null,{"$f":"Y170-MAX($E$17,$G$17)","v":0},0,0,null,null,null,null,null,null,"","","2019-03-31","2020-03-31",0,0,0,0,0,0,0,0,0,0,0,0,0,0,0]
[null,"September",null,null,null,{"$f":"Z170-MAX($E$17,$G$17)","v":0},0,0,null,null,null,null,null,null,"","","2019-03-31","2020-03-31",0,0,0,0,0,0,0,0,0,0,0,0,0,0,0]
[null,"October",null,null,null,{"$f":"AA170-MAX($E$21,$G$21)","v":0},0,0,null,null,null,null,null,null,"","","2019-03-31","2020-03-31",0,0,0,0,0,0,0,0,0,0,0,0,0,0,0]
[null,"November",null,null,null,{"$f":"AB170-MAX($E$21,$G$21)","v":0},0,0,null,null,null,null,null,null,"","","2019-03-31","2020-03-31",0,0,0,0,0,0,0,0,0,0,0,0,0,0,0]
[null,"December",null,null,null,{"$f":"AC170-MAX($E$21,$G$21)","v":0},0,0,null,null,null,null,null,null,"","","2019-03-31","2020-03-31",0,0,0,0,0,0,0,0,0,0,0,0,0,0,0]
[null,"January",null,null,null,{"$f":"AD170-MAX($E$21,$G$21)","v":0},0,0,null,null,null,null,null,null,"","","2019-03-31","2020-03-31",0,0,0,0,0,0,0,0,0,0,0,0,0,0,0]
[null,"February",null,null,null,{"$f":"AE170-MAX($E$21,$G$21)","v":0},0,0,null,null,null,null,null,null,"","","2019-03-31","2020-03-31",0,0,0,0,0,0,0,0,0,0,0,0,0,0,0]
[null,"March",null,null,null,{"$f":"AF170-MAX($E$21,$G$21)","v":0},0,0,null,null,null,null,null,null,"","","2019-03-31","2020-03-31",0,0,0,0,0,0,0,0,0,0,0,0,0,0,0]
[null,null,null,null,null,null,null,{"$f":"SUM(H46:H57)","v":0},null,null,null,null,null,null,"","","2019-03-31","2020-03-31",0,0,0,0,0,0,0,0,0,0,0,0,0,0,0]
[null,null,null,null,null,null,null,null,null,null,null,null,null,null,"","","2019-03-31","2020-03-31",0,0,0,0,0,0,0,0,0,0,0,0,0,0,0]
[null,null,null,null,null,null,null,null,null,null,null,null,null,null,"","","2019-03-31","2020-03-31",0,0,0,0,0,0,0,0,0,0,0,0,0,0,0]
[null,"Excess Element 2",null,null,null,null,null,null,null,null,null,null,null,null,"","","2019-03-31","2020-03-31",0,0,0,0,0,0,0,0,0,0,0,0,0,0,0]
[null,null,null,"Pre-16 Excess Pupil Numbers","Pre-16 Funding","Post-16 Excess Pupil Numbers","Post-16 Funding","Total Funding",null,null,null,null,null,null,"","","2019-03-31","2020-03-31",0,0,0,0,0,0,0,0,0,0,0,0,0,0,0]
[null,null,null,null,null,null,null,null,null,null,null,null,null,null,"","","2019-03-31","2020-03-31",0,0,0,0,0,0,0,0,0,0,0,0,0,0,0]
[null,"April",null,{"$f":"U176","v":0},{"$f":"IF(D64=0,0,$S$178)","v":0},{"$f":"U177","v":0},{"$f":"IF(F64=0,0,$S$179)","v":0},{"$f":"IF((D64*E64)+(F64*G64)<0,0,(D64*E64)+(F64*G64))","v":0},null,null,null,null,null,null,"","","2019-03-31","2020-03-31",0,0,0,0,0,0,0,0,0,0,0,0,0,0,0]
[null,"May",null,{"$f":"V176","v":0},{"$f":"IF(D65=0,0,$S$178)","v":0},{"$f":"V177","v":0},{"$f":"IF(F65=0,0,$S$179)","v":0},{"$f":"IF((D65*E65)+(F65*G65)<0,0,(D65*E65)+(F65*G65))","v":0},null,null,null,null,null,null,"","","2019-03-31","2020-03-31",0,0,0,0,0,0,0,0,0,0,0,0,0,0,0]
[null,"June",null,{"$f":"W176","v":0},0,{"$f":"W177","v":0},0,0,null,null,null,null,null,null,"","","2019-03-31","2020-03-31",0,0,0,0,0,0,0,0,0,0,0,0,0,0,0]
[null,"July",null,{"$f":"X176","v":0},0,{"$f":"X177","v":0},0,0,null,null,null,null,null,null,"","","2019-03-31","2020-03-31",0,0,0,0,0,0,0,0,0,0,0,0,0,0,0]
[null,"August",null,{"$f":"Y176","v":0},0,{"$f":"Y177","v":0},0,0,null,null,null,null,null,null,"","","2019-03-31","2020-03-31",0,0,0,0,0,0,0,0,0,0,0,0,0,0,0]
[null,"September",null,{"$f":"Z176","v":0},0,{"$f":"Z177","v":0},0,0,null,null,null,null,null,null,"","","2019-03-31","2020-03-31",0,0,0,0,0,0,0,0,0,0,0,0,0,0,0]
[null,"October",null,{"$f":"AA176","v":0},0,{"$f":"AA177","v":0},0,0,null,null,null,null,null,null,"","","2019-03-31","2020-03-31",0,0,0,0,0,0,0,0,0,0,0,0,0,0,0]
[null,"November",null,{"$f":"AB176","v":0},0,{"$f":"AB177","v":0},0,0,null,null,null,null,null,null,"","","2019-03-31","2020-03-31",0,0,0,0,0,0,0,0,0,0,0,0,0,0,0]
[null,"December",null,{"$f":"AC176","v":0},0,{"$f":"AC177","v":0},0,0,null,null,null,null,null,null,"","","2019-03-31","2020-03-31",0,0,0,0,0,0,0,0,0,0,0,0,0,0,0]
[null,"January",null,{"$f":"AD176","v":0},0,{"$f":"AD177","v":0},0,0,null,null,null,null,null,null,"","","2019-03-31","2020-03-31",0,0,0,0,0,0,0,0,0,0,0,0,0,0,0]
[null,"February",null,{"$f":"AE176","v":0},0,{"$f":"AE177","v":0},0,0,null,null,null,null,null,null,"","","2019-03-31","2020-03-31",0,0,0,0,0,0,0,0,0,0,0,0,0,0,0]
[null,"March",null,{"$f":"AF176","v":0},0,{"$f":"AF177","v":0},0,0,null,null,null,null,null,null,"","","2019-03-31","2020-03-31",0,0,0,0,0,0,0,0,0,0,0,0,0,0,0]
[null,null,null,null,null,null,null,{"$f":"SUM(H64:H75)","v":0},null,null,null,null,null,null,"","","2019-03-31","2020-03-31",0,0,0,0,0,0,0,0,0,0,0,0,0,0,0]
[null,null,null,null,null,null,null,null,null,null,null,null,null,null,"","","2019-03-31","2020-03-31",0,0,0,0,0,0,0,0,0,0,0,0,0,0,0]
[null,null,null,null,null,null,null,null,null,null,null,null,null,null,"","","2019-03-31","2020-03-31",0,0,0,0,0,0,0,0,0,0,0,0,0,0,0]
[null,null,null,null,null,null,null,null,null,null,null,null,null,null,"","","2019-03-31","2020-03-31",0,0,0,0,0,0,0,0,0,0,0,0,0,0,0]
[null,"Element 3 Top-up Funding",null,null,null,"Summary",null,null,null,null,null,null,null,null,"","","2019-03-31","2020-03-31",0,0,0,0,0,0,0,0,0,0,0,0,0,0,0]
[null,null,null,null,null,null,null,null,null,null,null,null,null,null,"","","2019-03-31","2020-03-31",{"$f":"IF(AND(K81=\"Designation 1\",O81=\"Pre-16\"),VLOOKUP(dfenum,data,12,0),\nIF(AND(K81=\"Designation 1\",O81=\"Post-16\"),VLOOKUP(dfenum,data,13,0),\nIF(AND(K81=\"Designation 2\",O81=\"Pre-16\"),VLOOKUP(dfenum,data,14,0),\nIF(AND(K81=\"Designation 1\",O81=\"Post-16\"),VLOOKUP(dfenum,data,15,0),0))))","v":0},{"$f":"IF(AND(K81=\"Designation 1\",P81=\"Pre-16\"),VLOOKUP(dfenum,data,12,0),\nIF(AND(K81=\"Designation 1\",P81=\"Post-16\"),VLOOKUP(dfenum,data,13,0),\nIF(AND(K81=\"Designation 2\",P81=\"Pre-16\"),VLOOKUP(dfenum,data,14,0),\nIF(AND(K81=\"Designation 2\",P81=\"Post-16\"),VLOOKUP(dfenum,data,15,0),0))))","v":0},0,0,0,0,0,0,0,0,0,0,0,0,0]
[null,"April",{"$f":"SUM($U$17:$U$168)","v":0},null,null,"Excess place funding (E1 & E2)",null,{"$f":"H58+H76","v":0},null,null,null,null,null,null,{"$f":"IF(N82=0,\"\",IF(N82<DATE(2002,9,1),\"Post-16\",\"Pre-16\"))","v":""},{"$f":"IF(N82=0,\"\",IF(N82<DATE(2003,9,1),\"Post-16\",\"Pre-16\"))","v":""},"2019-03-31","2020-03-31",0,0,{"$f":"IF(OR(Q82>DATE(2019,3,31),R82<DATE(2019,3,1)),0,S82)","v":0},{"$f":"IF(OR(Q82>DATE(2019,4,30),R82<DATE(2019,4,1)),0,S82)","v":0},{"$f":"IF(OR(Q82>DATE(2019,5,31),R82<DATE(2019,5,1)),0,S82)","v":0},{"$f":"IF(OR(Q82>DATE(2019,6,30),R82<DATE(2019,6,1)),0,S82)","v":0},{"$f":"IF(OR(Q82>DATE(2019,7,31),R82<DATE(2019,7,1)),0,S82)","v":0},{"$f":"IF(OR(Q82>DATE(2019,7,31),R82<DATE(2019,7,1)),0,S82)","v":0},{"$f":"IF(OR(Q82>DATE(2019,9,30),R82<DATE(2019,9,1)),0,T82)","v":0},{"$f":"IF(OR(Q82>DATE(2019,10,31),R82<DATE(2019,10,1)),0,T82)","v":0},{"$f":"IF(OR(Q82>DATE(2019,11,30),R82<DATE(2019,11,1)),0,T82)","v":0},{"$f":"IF(OR(Q82>DATE(2019,12,31),R82<DATE(2019,12,1)),0,T82)","v":0},{"$f":"IF(OR(Q82>DATE(2020,1,31),R82<DATE(2020,1,1)),0,T82)","v":0},{"$f":"IF(OR(Q82>DATE(2020,2,29),R82<DATE(2020,2,1)),0,T82)","v":0},0]
[null,"May",{"$f":"SUM($V$17:$V$168)","v":0},null,null,"Element 3 top-up funding",null,{"$f":"C94","v":0},null,null,null,null,null,null,"","","2019-03-31","2020-03-31",0,0,0,0,0,0,0,0,0,0,0,0,0,0,0]
[null,"June",{"$f":"SUM($W$17:$W$168)","v":0},null,null,null,null,null,null,null,null,null,null,null,"","","2019-03-31","2020-03-31",0,0,0,0,0,0,0,0,0,0,0,0,0,0,{"$f":"SUM(U84:AF84)","v":0}]
[null,"July",{"$f":"SUM($X$17:$X$168)","v":0},null,null,"Total SRP funding 2019/20",null,{"$f":"SUM(H82:H84)","v":0},null,null,null,null,null,null,"","","2019-03-31","2020-03-31",0,0,0,0,0,0,0,0,0,0,0,0,0,0,0]
[null,"August",{"$f":"SUM($Y$17:$Y$168)","v":0},null,null,null,null,null,null,null,null,null,null,null,"","","2019-03-31","2020-03-31",0,0,0,0,0,0,0,0,0,0,0,0,0,0,0]
[null,"September",{"$f":"SUM($Z$17:$Z$168)","v":0},null,null,null,null,null,null,null,null,null,null,null,"","","2019-03-31","2020-03-31",0,0,0,0,0,0,0,0,0,0,0,0,0,0,0]
[null,"October",{"$f":"SUM($AA$17:$AA$168)","v":0},null,null,null,null,null,null,null,null,null,null,null,"","","2019-03-31","2020-03-31",0,0,0,0,0,0,0,0,0,0,0,0,0,0,0]
[null,"November",{"$f":"SUM($AB$17:$AB$168)","v":0},null,null,null,null,null,null,null,null,null,null,null,"","","2019-03-31","2020-03-31",0,0,0,0,0,0,0,0,0,0,0,0,0,0,0]
[null,"December",{"$f":"SUM($AC$17:$AC$168)","v":0},null,null,null,null,null,null,null,null,null,null,null,"","","2019-03-31","2020-03-31",0,0,0,0,0,0,0,0,0,0,0,0,0,0,0]
[null,"January",{"$f":"SUM($AD$17:$AD$168)","v":0},null,null,null,null,null,null,null,null,null,null,null,"","","2019-03-31","2020-03-31",0,0,0,0,0,0,0,0,0,0,0,0,0,0,0]
[null,"February",{"$f":"SUM($AE$17:$AE$168)","v":0},null,null,null,null,null,null,null,null,null,null,null,"","","2019-03-31","2020-03-31",0,0,0,0,0,0,0,0,0,0,0,0,0,0,0]
[null,"March",{"$f":"SUM($AF$17:$AF$168)","v":0},null,null,null,null,null,null,null,null,null,null,null,"","","2019-03-31","2020-03-31",0,0,0,0,0,0,0,0,0,0,0,0,0,0,0]
[null,null,{"$f":"SUM(C82:C93)","v":0},null,null,null,null,null,null,null,null,null,null,null,"","","2019-03-31","2020-03-31",0,0,0,0,0,0,0,0,0,0,0,0,0,0,0]
[null,null,null,null,null,null,null,null,null,null,null,null,null,null,"","","2019-03-31","2020-03-31",0,0,0,0,0,0,0,0,0,0,0,0,0,0,0]
[null,null,null,null,null,null,null,null,null,null,null,null,null,null,"","","2019-03-31","2020-03-31",0,0,0,0,0,0,0,0,0,0,0,0,0,0,0]
[null,null,null,null,null,null,null,null,null,null,null,null,null,null,"","","2019-03-31","2020-03-31",0,0,0,0,0,0,0,0,0,0,0,0,0,0,0]
[null,null,null,null,null,null,null,null,null,null,null,null,null,null,"","","2019-03-31","2020-03-31",0,0,0,0,0,0,0,0,0,0,0,0,0,0,0]
[null,null,null,null,null,null,null,null,null,null,null,null,null,null,"","","2019-03-31","2020-03-31",0,0,0,0,0,0,0,0,0,0,0,0,0,0,0]
[null,null,null,null,null,null,null,null,null,null,null,null,null,null,"","","2019-03-31","2020-03-31",0,0,0,0,0,0,0,0,0,0,0,0,0,0,0]
[null,null,null,null,null,null,null,null,null,null,null,null,null,null,"","","2019-03-31","2020-03-31",0,0,0,0,0,0,0,0,0,0,0,0,0,0,0]
[null,null,null,null,null,null,null,null,null,null,null,null,null,null,"","","2019-03-31","2020-03-31",0,0,0,0,0,0,0,0,0,0,0,0,0,0,0]
[null,null,null,null,null,null,null,null,null,null,null,null,null,null,"","","2019-03-31","2020-03-31",0,0,0,0,0,0,0,0,0,0,0,0,0,0,0]
[null,null,null,null,null,null,null,null,null,null,null,null,null,null,"","","2019-03-31","2020-03-31",0,0,0,0,0,0,0,0,0,0,0,0,0,0,0]
[null,null,null,null,null,null,null,null,null,null,null,null,null,null,"","","2019-03-31","2020-03-31",0,0,0,0,0,0,0,0,0,0,0,0,0,0,0]
[null,null,null,null,null,null,null,null,null,null,null,null,null,null,"","","2019-03-31","2020-03-31",0,0,0,0,0,0,0,0,0,0,0,0,0,0,0]
[null,null,null,null,null,null,null,null,null,null,null,null,null,null,"","","2019-03-31","2020-03-31",0,0,0,0,0,0,0,0,0,0,0,0,0,0,0]
[null,null,null,null,null,null,null,null,null,null,null,null,null,null,"","","2019-03-31","2020-03-31",0,0,0,0,0,0,0,0,0,0,0,0,0,0,0]
[null,null,null,null,null,null,null,null,null,null,null,null,null,null,"","","2019-03-31","2020-03-31",0,0,0,0,0,0,0,0,0,0,0,0,0,0,0]
[null,null,null,null,null,null,null,null,null,null,null,null,null,null,"","","2019-03-31","2020-03-31",0,0,0,0,0,0,0,0,0,0,0,0,0,0,0]
[null,null,null,null,null,null,null,null,null,null,null,null,null,null,"","","2019-03-31","2020-03-31",0,0,0,0,0,0,0,0,0,0,0,0,0,0,0]
[null,null,null,null,null,null,null,null,null,null,null,null,null,null,"","","2019-03-31","2020-03-31",0,0,0,0,0,0,0,0,0,0,0,0,0,0,0]
[null,null,null,null,null,null,null,null,null,null,null,null,null,null,"","","2019-03-31","2020-03-31",{"$f":"IF(AND(K113=\"Designation 1\",O113=\"Pre-16\"),VLOOKUP(dfenum,data,12,0),\nIF(AND(K113=\"Designation 1\",O113=\"Post-16\"),VLOOKUP(dfenum,data,13,0),\nIF(AND(K113=\"Designation 2\",O113=\"Pre-16\"),VLOOKUP(dfenum,data,14,0),\nIF(AND(K113=\"Designation 1\",O113=\"Post-16\"),VLOOKUP(dfenum,data,15,0),0))))","v":0},{"$f":"IF(AND(K113=\"Designation 1\",P113=\"Pre-16\"),VLOOKUP(dfenum,data,12,0),\nIF(AND(K113=\"Designation 1\",P113=\"Post-16\"),VLOOKUP(dfenum,data,13,0),\nIF(AND(K113=\"Designation 2\",P113=\"Pre-16\"),VLOOKUP(dfenum,data,14,0),\nIF(AND(K113=\"Designation 2\",P113=\"Post-16\"),VLOOKUP(dfenum,data,15,0),0))))","v":0},0,0,0,0,0,0,0,0,0,0,0,0,0]
[null,null,null,null,null,null,null,null,null,null,null,null,null,null,"","","2019-03-31","2020-03-31",0,0,0,0,0,0,0,0,0,0,0,0,0,0,0]
[null,null,null,null,null,null,null,null,null,null,null,null,null,null,"","","2019-03-31","2020-03-31",0,0,0,0,0,0,0,0,0,0,0,0,0,0,0]
[null,null,null,null,null,null,null,null,null,null,null,null,null,null,"","","2019-03-31","2020-03-31",0,0,0,0,0,0,0,0,0,0,0,0,0,0,0]
[null,null,null,null,null,null,null,null,null,null,null,null,null,null,"","","2019-03-31","2020-03-31",0,0,0,0,0,0,0,0,0,0,0,0,0,0,0]
[null,null,null,null,null,null,null,null,null,null,null,null,null,null,"","","2019-03-31","2020-03-31",0,0,0,0,0,0,0,0,0,0,0,0,0,0,0]
[null,null,null,null,null,null,null,null,null,null,null,null,null,null,"","","2019-03-31","2020-03-31",0,0,0,0,0,0,0,0,0,0,0,0,0,0,0]
[null,null,null,null,null,null,null,null,null,null,null,null,null,null,"","","2019-03-31","2020-03-31",0,0,0,0,0,0,0,0,0,0,0,0,0,0,0]
[null,null,null,null,null,null,null,null,null,null,null,null,null,null,"","","2019-03-31","2020-03-31",0,0,0,0,0,0,0,0,0,0,0,0,0,0,0]
[null,null,null,null,null,null,null,null,null,null,null,null,null,null,"","","2019-03-31","2020-03-31",0,0,0,0,0,0,0,0,0,0,0,0,0,0,0]
[null,null,null,null,null,null,null,null,null,null,null,null,null,null,"","","2019-03-31","2020-03-31",0,0,0,0,0,0,0,0,0,0,0,0,0,0,0]
[null,null,null,null,null,null,null,null,null,null,null,null,null,null,"","","2019-03-31","2020-03-31",0,0,0,0,0,0,0,0,0,0,0,0,0,0,0]
[null,null,null,null,null,null,null,null,null,null,null,null,null,null,"","","2019-03-31","2020-03-31",0,0,0,0,0,0,0,0,0,0,0,0,0,0,0]
[null,null,null,null,null,null,null,null,null,null,null,null,null,null,"","","2019-03-31","2020-03-31",0,0,0,0,0,0,0,0,0,0,0,0,0,0,0]
[null,null,null,null,null,null,null,null,null,null,null,null,null,null,"","","2019-03-31","2020-03-31",0,0,0,0,0,0,0,0,0,0,0,0,0,0,0]
[null,null,null,null,null,null,null,null,null,null,null,null,null,null,"","","2019-03-31","2020-03-31",0,0,0,0,0,0,0,0,0,0,0,0,0,0,0]
[null,null,null,null,null,null,null,null,null,null,null,null,null,null,"","","2019-03-31","2020-03-31",0,0,0,0,0,0,0,0,0,0,0,0,0,0,0]
[null,null,null,null,null,null,null,null,null,null,null,null,null,null,"","","2019-03-31","2020-03-31",0,0,0,0,0,0,0,0,0,0,0,0,0,0,0]
[null,null,null,null,null,null,null,null,null,null,null,null,null,null,"","","2019-03-31","2020-03-31",0,0,0,0,0,0,0,0,0,0,0,0,0,0,0]
[null,null,null,null,null,null,null,null,null,null,null,null,null,null,"","","2019-03-31","2020-03-31",0,0,0,0,0,0,0,0,0,0,0,0,0,0,0]
[null,null,null,null,null,null,null,null,null,null,null,null,null,null,"","","2019-03-31","2020-03-31",0,0,0,0,0,0,0,0,0,0,0,0,0,0,0]
[null,null,null,null,null,null,null,null,null,null,null,null,null,null,"","","2019-03-31","2020-03-31",0,0,0,0,0,0,0,0,0,0,0,0,0,0,0]
[null,null,null,null,null,null,null,null,null,null,null,null,null,null,"","","2019-03-31","2020-03-31",0,0,0,0,0,0,0,0,0,0,0,0,0,0,0]
[null,null,null,null,null,null,null,null,null,null,null,null,null,null,"","","2019-03-31","2020-03-31",0,0,0,0,0,0,0,0,0,0,0,0,0,0,0]
[null,null,null,null,null,null,null,null,null,null,null,null,null,null,"","","2019-03-31","2020-03-31",0,0,0,0,0,0,0,0,0,0,0,0,0,0,0]
[null,null,null,null,null,null,null,null,null,null,null,null,null,null,"","","2019-03-31","2020-03-31",0,0,0,0,0,0,0,0,0,0,0,0,0,0,0]
[null,null,null,null,null,null,null,null,null,null,null,null,null,null,"","","2019-03-31","2020-03-31",0,0,0,0,0,0,0,0,0,0,0,0,0,0,0]
[null,null,null,null,null,null,null,null,null,null,null,null,null,null,"","","2019-03-31","2020-03-31",0,0,0,0,0,0,0,0,0,0,0,0,0,0,0]
[null,null,null,null,null,null,null,null,null,null,null,null,null,null,"","","2019-03-31","2020-03-31",0,0,0,0,0,0,0,0,0,0,0,0,0,0,0]
[null,null,null,null,null,null,null,null,null,null,null,null,null,null,"","","2019-03-31","2020-03-31",0,0,0,0,0,0,0,0,0,0,0,0,0,0,0]
[null,null,null,null,null,null,null,null,null,null,null,null,null,null,"","","2019-03-31","2020-03-31",0,0,0,0,0,0,0,0,0,0,0,0,0,0,0]
[null,null,null,null,null,null,null,null,null,null,null,null,null,null,"","","2019-03-31","2020-03-31",0,0,0,0,0,0,0,0,0,0,0,0,0,0,0]
[null,null,null,null,null,null,null,null,null,null,null,null,null,null,"","","2019-03-31","2020-03-31",{"$f":"IF(AND(K145=\"Designation 1\",O145=\"Pre-16\"),VLOOKUP(dfenum,data,12,0),\nIF(AND(K145=\"Designation 1\",O145=\"Post-16\"),VLOOKUP(dfenum,data,13,0),\nIF(AND(K145=\"Designation 2\",O145=\"Pre-16\"),VLOOKUP(dfenum,data,14,0),\nIF(AND(K145=\"Designation 1\",O145=\"Post-16\"),VLOOKUP(dfenum,data,15,0),0))))","v":0},{"$f":"IF(AND(K145=\"Designation 1\",P145=\"Pre-16\"),VLOOKUP(dfenum,data,12,0),\nIF(AND(K145=\"Designation 1\",P145=\"Post-16\"),VLOOKUP(dfenum,data,13,0),\nIF(AND(K145=\"Designation 2\",P145=\"Pre-16\"),VLOOKUP(dfenum,data,14,0),\nIF(AND(K145=\"Designation 2\",P145=\"Post-16\"),VLOOKUP(dfenum,data,15,0),0))))","v":0},0,0,0,0,0,0,0,0,0,0,0,0,0]
[null,null,null,null,null,null,null,null,null,null,null,null,null,null,{"$f":"IF(N146=0,\"\",IF(N146<DATE(2002,9,1),\"Post-16\",\"Pre-16\"))","v":""},{"$f":"IF(N146=0,\"\",IF(N146<DATE(2003,9,1),\"Post-16\",\"Pre-16\"))","v":""},"2019-03-31","2020-03-31",0,0,{"$f":"IF(OR(Q146>DATE(2019,3,31),R146<DATE(2019,3,1)),0,S146)","v":0},{"$f":"IF(OR(Q146>DATE(2019,4,30),R146<DATE(2019,4,1)),0,S146)","v":0},{"$f":"IF(OR(Q146>DATE(2019,5,31),R146<DATE(2019,5,1)),0,S146)","v":0},{"$f":"IF(OR(Q146>DATE(2019,6,30),R146<DATE(2019,6,1)),0,S146)","v":0},{"$f":"IF(OR(Q146>DATE(2019,7,31),R146<DATE(2019,7,1)),0,S146)","v":0},{"$f":"IF(OR(Q146>DATE(2019,7,31),R146<DATE(2019,7,1)),0,S146)","v":0},{"$f":"IF(OR(Q146>DATE(2019,9,30),R146<DATE(2019,9,1)),0,T146)","v":0},{"$f":"IF(OR(Q146>DATE(2019,10,31),R146<DATE(2019,10,1)),0,T146)","v":0},{"$f":"IF(OR(Q146>DATE(2019,11,30),R146<DATE(2019,11,1)),0,T146)","v":0},{"$f":"IF(OR(Q146>DATE(2019,12,31),R146<DATE(2019,12,1)),0,T146)","v":0},{"$f":"IF(OR(Q146>DATE(2020,1,31),R146<DATE(2020,1,1)),0,T146)","v":0},{"$f":"IF(OR(Q146>DATE(2020,2,29),R146<DATE(2020,2,1)),0,T146)","v":0},0]
[null,null,null,null,null,null,null,null,null,null,null,null,null,null,"","","2019-03-31","2020-03-31",0,0,0,0,0,0,0,0,0,0,0,0,0,0,0]
[null,null,null,null,null,null,null,null,null,null,null,null,null,null,"","","2019-03-31","2020-03-31",0,0,0,0,0,0,0,0,0,0,0,0,0,0,{"$f":"SUM(U148:AF148)","v":0}]
[null,null,null,null,null,null,null,null,null,null,null,null,null,null,"","","2019-03-31","2020-03-31",0,0,0,0,0,0,0,0,0,0,0,0,0,0,0]
[null,null,null,null,null,null,null,null,null,null,null,null,null,null,"","","2019-03-31","2020-03-31",0,0,0,0,0,0,0,0,0,0,0,0,0,0,0]
[null,null,null,null,null,null,null,null,null,null,null,null,null,null,"","","2019-03-31","2020-03-31",0,0,0,0,0,0,0,0,0,0,0,0,0,0,0]
[null,null,null,null,null,null,null,null,null,null,null,null,null,null,"","","2019-03-31","2020-03-31",0,0,0,0,0,0,0,0,0,0,0,0,0,0,0]
[null,null,null,null,null,null,null,null,null,null,null,null,null,null,"","","2019-03-31","2020-03-31",0,0,0,0,0,0,0,0,0,0,0,0,0,0,0]
[null,null,null,null,null,null,null,null,null,null,null,null,null,null,"","","2019-03-31","2020-03-31",0,0,0,0,0,0,0,0,0,0,0,0,0,0,0]
[null,null,null,null,null,null,null,null,null,null,null,null,null,null,"","","2019-03-31","2020-03-31",0,0,0,0,0,0,0,0,0,0,0,0,0,0,0]
[null,null,null,null,null,null,null,null,null,null,null,null,null,null,"","","2019-03-31","2020-03-31",0,0,0,0,0,0,0,0,0,0,0,0,0,0,0]
[null,null,null,null,null,null,null,null,null,null,null,null,null,null,"","","2019-03-31","2020-03-31",0,0,0,0,0,0,0,0,0,0,0,0,0,0,0]
[null,null,null,null,null,null,null,null,null,null,null,null,null,null,"","","2019-03-31","2020-03-31",0,0,0,0,0,0,0,0,0,0,0,0,0,0,0]
[null,null,null,null,null,null,null,null,null,null,null,null,null,null,"","","2019-03-31","2020-03-31",0,0,0,0,0,0,0,0,0,0,0,0,0,0,0]
[null,null,null,null,null,null,null,null,null,null,null,null,null,null,"","","2019-03-31","2020-03-31",0,0,0,0,0,0,0,0,0,0,0,0,0,0,0]
[null,null,null,null,null,null,null,null,null,null,null,null,null,null,"","","2019-03-31","2020-03-31",0,0,0,0,0,0,0,0,0,0,0,0,0,0,0]
[null,null,null,null,null,null,null,null,null,null,null,null,null,null,"","","2019-03-31","2020-03-31",0,0,0,0,0,0,0,0,0,0,0,0,0,0,0]
[null,null,null,null,null,null,null,null,null,null,null,null,null,null,"","","2019-03-31","2020-03-31",0,0,0,0,0,0,0,0,0,0,0,0,0,0,0]
[null,null,null,null,null,null,null,null,null,null,null,null,null,null,"","","2019-03-31","2020-03-31",0,0,0,0,0,0,0,0,0,0,0,0,0,0,0]
[null,null,null,null,null,null,null,null,null,null,null,null,null,null,"","","2019-03-31","2020-03-31",0,0,0,0,0,0,0,0,0,0,0,0,0,0,0]
[null,null,null,null,null,null,null,null,null,null,null,null,null,null,"","","2019-03-31","2020-03-31",0,0,0,0,0,0,0,0,0,0,0,0,0,0,0]
[null,null,null,null,null,null,null,null,null,null,null,null,null,null,"","","2019-03-31","2020-03-31",0,0,0,0,0,0,0,0,0,0,0,0,0,0,0]
[null,null,null,null,null,null,null,null,null,null,null,null,null,null,"","","2019-03-31","2020-03-31",0,0,0,0,0,0,0,0,0,0,0,0,0,0,0]
[]
[null,null,null,null,null,null,null,null,null,null,null,null,null,null,null,null,null,"pre-16 D1",{"$f":"IF(VLOOKUP(dfenum,data,12,0)=0,\"\",VLOOKUP(dfenum,data,12,0))","v":""},null,{"$f":"COUNTIFS(U$17:U$168,$S170,$O$17:$O$168,\"Pre-16\")","v":0},0,0,0,0,0,{"$f":"COUNTIFS(AA$17:AA$168,$S170,$P$17:$P$168,\"Pre-16\")","v":0},0,0,0,0,0]
[null,null,null,null,null,null,null,null,null,null,null,null,null,null,null,null,null,"pre-16 D2",{"$f":"IF(VLOOKUP(dfenum,data,14,0)=0,\"\",VLOOKUP(dfenum,data,14,0))","v":""},null,0,0,0,0,0,0,0,0,0,0,0,0]
[null,null,null,null,null,null,null,null,null,null,null,null,null,null,null,null,null,"post-16 D1",{"$f":"IF(VLOOKUP(dfenum,data,13,0)=0,\"\",VLOOKUP(dfenum,data,13,0))","v":""},null,{"$f":"COUNTIFS(U$17:U$168,$S172,$O$17:$O$168,\"Post-16\")","v":0},0,0,0,0,0,{"$f":"COUNTIFS(AA$17:AA$168,$S172,$P$17:$P$168,\"Post-16\")","v":0},0,0,0,0,0]
[null,null,null,null,null,null,null,null,null,null,null,null,null,null,null,null,null,"post-16 D2",{"$f":"IF(VLOOKUP(dfenum,data,15,0)=0,\"\",VLOOKUP(dfenum,data,15,0))","v":""},null,0,0,0,0,0,0,0,0,0,0,0,0]
[null,null,null,null,null,null,null,null,null,null,null,null,null,null,null,null,null,"pre-16 places",null,null,{"$f":"$E$30","v":0},{"$f":"$E$30","v":0},0,0,0,0,{"$f":"$E$31","v":0},{"$f":"$E$31","v":0},0,0,0,0]
[null,null,null,null,null,null,null,null,null,null,null,null,null,null,null,null,null,"post-16 places",null,null,{"$f":"$E$34","v":0},{"$f":"$E$34","v":0},0,0,0,0,{"$f":"$E$35","v":0},{"$f":"$E$35","v":0},0,0,0,0]
[null,null,null,null,null,null,null,null,null,null,null,null,null,null,null,null,null,"excess pre-16",null,null,{"$f":"(U170+U171-U174)","v":0},{"$f":"(V170+V171-V174)","v":0},{"$f":"(W170+W171-W174)","v":0},0,0,0,0,0,0,0,0,0]
[null,null,null,null,null,null,null,null,null,null,null,null,null,null,null,null,null,"excess post-16",null,null,{"$f":"U172+U173-U175","v":0},{"$f":"V172+V173-V175","v":0},0,0,0,0,0,0,0,0,0,0]
[null,null,null,null,null,null,null,null,null,null,null,null,null,null,null,null,null,"pre-16 cash",{"$f":"6000/12","v":500},null,{"$f":"U176*$S$178","v":0},{"$f":"V176*$S$178","v":0},{"$f":"W176*$S$178","v":0},{"$f":"X176*$S$178","v":0},0,0,0,0,0,0,0,0]
[null,null,null,null,null,null,null,null,null,null,null,null,null,null,null,null,null,"post-16 cash",{"$f":"6000/12","v":500},null,{"$f":"U177*$S179","v":0},{"$f":"V177*$S179","v":0},0,0,0,0,0,0,0,0,0,0]
[null,null,null,null,null,null,null,null,null,null,null,null,null,null,null,null,null,"Excess E1",{"$f":"4000/12","v":333.33333333333331},null,{"$f":"IF(U170>$F$36,(U170-$F$36)*$S$180,0)","v":0},{"$f":"IF(V170>$F$36,(V170-$F$36)*$S$180,0)","v":0},0,0,0,0,0,0,{"$f":"IF(AC170>$F$36,(AC170-$F$36)*$S$180,0)","v":0},0,0,0]
[null,null,null,null,null,null,null,null,null,null,null,null,null,null,null,null,null,"excess funding",null,null,{"$f":"IF(U179+U178+U180<0,0,U179+U178+U180)","v":0},{"$f":"IF(V179+V178+V180<0,0,V179+V178+V180)","v":0},0,0,0,0,0,0,0,0,0,0]

{"sheet":"Growth Funding","index":8,"n_rows":29,"n_cols":7,"rows_kept":29,"cut":false,"hidden":false,"merged":[[6,1,6,6],[8,1,8,6],[10,1,10,6],[11,1,11,6]]}
[null,null,null,null,null,null,{"$f":"dfenum","v":2009}]
[]
[]
[]
[]
[]
[null,{"$f":"academyname","v":"Northdown Primary School"}]
[]
[null,"Growth Funding Estimator"]
[]
[null,"Only complete this tab if Growth Funding has been agreed by Kent County Council. Growth funding entitlement only applies to Basic Need pupil increases."]
[null,"Definition - The DfE define Basic Need as new pupil places which are requested by the LA because there are insufficient places available for pupils in the area. Area Education Officers (AEOs) determine if schools meet eligibility for the DfE Basic Need criteria.\nIf a school meets the Basic Need criteria, growth funding will be allocated under either of the headings Reorganisation or Rising Roll (RR)."]
[null,null,null,"Rising Roll Funding"]
[]
[null,"April 2019 to August 2019",null,"Payment Profiled Monthly"]
[null,"September 2019 to March 2020",null,"Full Payment 7/12's December 2019"]
[null,"April 2020 to August 2020",null,"Payment Profiled Monthly"]
[null,"April 2019 to August 2020",null,null,{"$f":"IFERROR(VLOOKUP(Home!F11,data,25,0),0)","v":0}]
[]
[null,"September 2019 to March 2020",null,"Qualifying year",{"$f":"IFERROR(VLOOKUP(8860000+dfenum,'Growth Data'!A:K,3,0),\"NO\")","v":"NO"}]
[null,null,null,"Lower Threshold (Old PAN or number of pupils leaving in Year 6 or Year 11",{"$f":"IF(E20=\"YES\",VLOOKUP(8860000+dfenum,'Growth Data'!A:K,6,0),0)","v":0}]
[null,null,null,"Upper Threshold (New PAN)",{"$f":"IF(E20=\"YES\",VLOOKUP(8860000+dfenum,'Growth Data'!A:K,7,0),0)","v":0}]
[null,null,null,{"$f":"\"Pupils in Year \"&IF(Home!C14=2,7,\"R\")&\" Oct 19\"","v":"Pupils in Year R Oct 19"}]
[null,null,null,"Qualifying pupils",{"$f":"IFERROR(IF(E20=\"NO\",0,IF(E23<E21,0,IF(E23>E22,E22-E21,E23-E21))),0)","v":0}]
[null,null,null,{"$f":"\"Rate ( £\"&SUM((E25/7)*12)&\" = 12/12's) - 7/12's\"","v":"Rate ( £0 = 12/12's) - 7/12's"},{"$f":"IF(qual1=\"YES\",IF(Home!$C$14=1,2748.89*(7/12),IF(Home!$C$14=2,3865.32*(7/12),0)),0)","v":0}]
[]
[null,null,null,"Rising Roll",{"$f":"E24*E25","v":0}]
[null,"April 2020 to August 2020"]
[null,null,null,{"$f":"\"Rate ( £\"&SUM((E25/7)*12)&\" = 12/12's) - 5/12's = £\"&ROUND(SUM((E25/7)*5),2)","v":"Rate ( £0 = 12/12's) - 5/12's = £0"},{"$f":"(E27/7)*5","v":0}]

{"sheet":"SRP Rates","index":9,"n_rows":72,"n_cols":51,"rows_kept":72,"cut":false,"hidden":false,"merged":[[1,22,1,26],[1,28,1,39],[1,41,1,48],[3,17,4,20],[4,5,4,6],[4,7,4,8],[4,9,4,10],[1,5,1,10],[1,12,1,20]]}
["How your SRP rate was calculated…",null,null,null,null,"Step 1",null,null,null,null,null,null,"Step 2",null,null,null,null,null,null,null,null,null,"Step 3",null,null,null,null,null,"Step 4",null,null,null,null,null,null,null,null,null,null,null,null,"Step 4"]
[null,null,null,null,null,"First of all we need to establish the commissioned place numbers pre and post 16 in both relevant academic years and the weighted average number of places in the financial year.",null,null,null,null,null,null,"The first part of your SRP rate is based on the rates previously known as Individually assigned resources (IAR). There are four rates based on the need type of the pupil, so we need to establish the mix of needs types at your school and allocate your places using this mix.",null,null,null,null,null,null,null,null,null,"Now that we have established the mix to be used, we can work out the total amount of cash that your number of places should attract if you are exactly at capacity. Then work out the average per place and feed it into your SRP rate.",null,null,null,null,null,null,null,null,null,null,null,null,null,null,null,null,null,null,"Finally we can now bring everything together to find your SRP rate. The rate is only the IAR element as these pupils also attract funding through either the schools formula budget or the 16-19 allocations. From the total rate we deduct £6,000 element 2 to reach the element 3 rate.\nPre 16 E3 Rate = IAR Element - E2 (£6,000)\nPost 16 E3 Rate = IAR Element - E2 (£6,000)"]
[null,null,null,null,null,null,null,null,null,null,null,null,null,null,null,null,null,null,null,null,null,null,14551.228288451965,19028.881051269283,10653.095777084111,12602.662032768039,"1-3"]
[null,null,null,null,null,"Place Numbers",null,null,null,null,null,null,"Actual pupils in October 2018 census",null,null,null,null,"Spread of commissioned places with October mix",null,null,null,null,14051.228288451965,16028.881051269283,8653.0957770841123,10602.662032768039,"4-20"]
[null,null,null,null,null,"2018/19 Academic",null,"2019/20 Academic",null,"2019/20 Financial",null,null,null,null,null,null,null,null,null,null,null,null,12551.228288451965,15028.881051269283,6653.0957770841123,8602.6620327680394,"20+"]
[null,null,"DFE","School",null,"Pre 16","Post 16","Pre 16","Post 16","Pre 16","Post 16",null,"ASD","PD, HI & VI","SLCN & SPLD","SLD",null,"ASD","PD, HI & VI","SLCN & SPLD","SLD",null,"ASD","PD, HI & VI","SLCN & SPLD","SLD","Average £",null,"AWPU Primary","AWPU KS3","AWPU KS4","FSM","IDACI","LAC","EAL","Prior Attainment","London Fringe","Total","NOR","Average £",null,"Pre-16 total rate","Post-16 total rate",null,"Element 1 pre-16","Element 1 post-16","Element 2 all ages","Element 3 pre-16","Element 3 post-16","Element 3 pre-16\n(Monthly)","Element 3 post-16\n(Monthly)"]
[null,2155,2155,"Slade Primary School",null,5,0,5,0,5,0,null,0,7,0,0,null,0,5,0,0,null,{"$f":"IF(R7>20,(3*W$3)+(17*W$4)+((R7-20)*W$5),\nIF(R7>3,(3*W$3)+((R7-3)*W$4),\nR7*W$3))","v":0},89144.405256346421,0,0,{"$f":"SUM(W7:Z7)/SUM(R7:U7)","v":17828.881051269283},null,null,null,null,null,null,null,null,null,null,null,null,null,null,{"$f":"AA7+AN7","v":17828.881051269283},{"$f":"IF(K7>0,AA7,0)","v":0},null,"Included in the Schools Formula Budget","Included in 16-19 allocation",6000,{"$f":"AP7-AU7","v":11828.881051269283},{"$f":"IF(AQ7-AU7<0,0,AQ7-AU7)","v":0},{"$f":"AV7/12","v":985.74008760577362},0]
[null,2312,2312,"River Primary School",null,12,0,12,0,12,0,null,0,0,9,0,null,0,0,12,0,null,0,0,109837.14932500935,0,9153.0957770841123,null,null,null,null,null,null,null,null,null,null,null,null,null,null,9153.0957770841123,0,null,"Included in the Schools Formula Budget","Included in 16-19 allocation",6000,{"$f":"AP8-AU8","v":3153.0957770841123},0,262.75798142367603,0]
[null,2434,2434,"West Minster Primary",null,12,0,15,0,13.75,0,null,0,0,15,0,null,0,0,13.75,0,null,0,0,124980.06693490654,0,9089.4594134477484,null,null,null,null,null,null,null,null,null,null,null,null,null,null,9089.4594134477484,0,null,"Included in the Schools Formula Budget","Included in 16-19 allocation",6000,3089.4594134477484,0,257.45495112064572,0]
[null,2603,2490,"Bishops Down Primary School",null,7,0,7,0,7.0000000000000009,0,null,0,5,1,0,null,0,5.8333333333333339,1.1666666666666667,0,null,0,102501.80613240416,12428.611739931463,0,16418.631124619373,null,null,null,null,null,null,null,null,null,null,null,null,null,null,16418.631124619373,0,null,"Included in the Schools Formula Budget","Included in 16-19 allocation",6000,10418.631124619373,0,868.21926038494769,0]
[null,2661,2603,"Bromstone Primary School, Broadstairs",null,16,0,16,0,16,0,null,6,3,12,3,null,4,2,8,2,null,57704.913153807858,38057.762102538567,75224.766216672899,25205.324065536079,12262.047846159712,null,null,null,null,null,null,null,null,null,null,null,null,null,null,12262.047846159712,0,null,"Included in the Schools Formula Budget","Included in 16-19 allocation",6000,6262.0478461597122,0,521.83732051330935,0]
[null,3296,2661,"Cage Green Primary School",null,31,0,31,0,31.000000000000004,0,null,26,0,1,0,null,29.851851851851855,0,1.1481481481481481,0,null,406177.40742564015,0,12231.332188503979,0,13497.056116585294,null,null,null,null,null,null,null,null,null,null,null,null,null,null,13497.056116585294,0,null,"Included in the Schools Formula Budget","Included in 16-19 allocation",6000,7497.0561165852941,0,624.75467638210785,0]
[null,3902,3296,"Langafel CEP School",null,20,0,20,0,20,0,null,23,0,1,0,null,19.166666666666668,0,0.83333333333333326,0,null,270815.20886199601,0,8877.5798142367585,0,13984.639433811641,null,null,null,null,null,null,null,null,null,null,null,null,null,null,13984.639433811641,0,null,"Included in the Schools Formula Budget","Included in 16-19 allocation",6000,7984.6394338116406,0,665.38661948430342,0]
[null,3904,3902,"Hythe Bay C of E Primary School",null,16,0,22,0,19.5,0,null,0,1,18,0,null,0,1.0263157894736841,18.473684210526315,0,null,0,19529.641078934263,165854.55882929071,0,9506.8820465756398,null,null,null,null,null,null,null,null,null,null,null,null,null,null,9506.8820465756398,0,null,"Included in the Schools Formula Budget","Included in 16-19 allocation",6000,3506.8820465756398,0,292.24017054796997,0]
[null,3909,3904,"Castle Hill Community Primary School",null,6,0,5,0,5.416666666666667,0,null,0,10,0,0,null,0,5.416666666666667,0,0,null,0,95823.105694375292,0,0,17690.419512807744,null,null,null,null,null,null,null,null,null,null,null,null,null,null,17690.419512807744,0,null,"Included in the Schools Formula Budget","Included in 16-19 allocation",6000,11690.419512807744,0,974.20162606731208,0]
[null,3910,3909,"Ashford Oaks Community Primary School",null,8,0,8,0,8,0,null,8,0,0,0,null,8,0,0,0,null,113909.8263076157,0,0,0,14238.728288451963,null,null,null,null,null,null,null,null,null,null,null,null,null,null,14238.728288451963,0,null,"Included in the Schools Formula Budget","Included in 16-19 allocation",6000,8238.7282884519627,0,686.56069070433023,0]
[null,3917,3910,"Joy Lane Primary School",null,30,0,30,0,30,0,null,26,0,1,0,null,28.888888888888886,0,1.1111111111111112,0,null,394091.03944416781,0,11836.773085649013,0,13530.927084327228,null,null,null,null,null,null,null,null,null,null,null,null,null,null,13530.927084327228,0,null,"Included in the Schools Formula Budget","Included in 16-19 allocation",6000,7530.9270843272279,0,627.57725702726896,0]
[null,4065,3917,"Garlinge Primary School",null,4,0,4,0,4,0,null,0,3,0,0,null,0,4,0,0,null,0,73115.524205077134,0,0,18278.881051269283,null,null,null,null,null,null,null,null,null,null,null,null,null,null,18278.881051269283,0,null,"Included in the Schools Formula Budget","Included in 16-19 allocation",6000,12278.881051269283,0,1023.2400876057736,0]
[null,4246,4065,"Holmesdale Technology College",null,4,0,6,0,5.166666666666667,0,null,5,0,0,0,null,5.166666666666667,0,0,0,null,74098.012823668483,0,0,0,14341.550869097126,null,null,null,null,null,null,null,null,null,null,null,null,null,null,14341.550869097126,0,null,"Included in the Schools Formula Budget","Included in 16-19 allocation",6000,8341.5508690971255,0,695.12923909142717,0]
[null,5221,4246,"The North School",null,25,0,25,0,25,0,null,27,0,0,0,null,25,0,0,0,null,345280.7072112991,0,0,0,13811.228288451965,null,null,null,null,null,null,null,null,null,null,null,null,null,null,13811.228288451965,0,null,"Included in the Schools Formula Budget","Included in 16-19 allocation",6000,7811.2282884519645,0,650.93569070433034,0]
[null,5229,5221,"Wincheap Foundation Primary School",null,25,0,20,0,22.083333333333336,0,null,0,0,21,0,null,0,0,22.083333333333336,0,null,0,0,192922.53174394084,0,8736.1146450086417,null,null,null,null,null,null,null,null,null,null,null,null,null,null,8736.1146450086417,0,null,"Included in the Schools Formula Budget","Included in 16-19 allocation",6000,2736.1146450086417,0,228.00955375072013,0]
[null,5407,5229,"Fleetdown Primary School",null,13,0,13,0,13,0,null,0,13,0,0,null,0,13,0,0,null,0,217375.45366650069,0,0,16721.188743576975,null,null,null,null,null,null,null,null,null,null,null,null,null,null,{"$f":"AA22+AN22","v":16721.188743576975},0,null,"Included in the Schools Formula Budget","Included in 16-19 allocation",6000,10721.188743576975,0,893.43239529808125,0]
[null,5412,5407,"Thamesview School",null,8,0,6,0,6.8333333333333339,0,null,0,9,0,0,null,0,6.8333333333333339,0,0,null,{"$f":"IF(R23>20,(3*W$3)+(17*W$4)+((R23-20)*W$5),\nIF(R23>3,(3*W$3)+((R23-3)*W$4),\nR23*W$3))","v":0},118530.68718367344,0,0,17345.95422200099,null,null,null,null,null,null,null,null,null,null,null,null,null,null,17345.95422200099,0,null,"Included in the Schools Formula Budget","Included in 16-19 allocation",6000,11345.95422200099,0,945.49618516674911,0]
[null,5425,5412,"Simon Langton Grammar School for Boys",null,23,0,23,0,23,0,null,24,0,0,0,null,23,0,0,0,null,320178.25063439517,0,0,0,13920.793505843269,null,null,null,null,null,null,null,null,null,null,null,null,null,null,13920.793505843269,0,null,"Included in the Schools Formula Budget","Included in 16-19 allocation",6000,7920.7935058432686,0,660.06612548693909,0]
[null,5431,5425,"The Malling School",null,80,28,80,28,80,27.999999999999996,null,47,2,59,1,null,46.568807339449542,1.9816513761467891,58.458715596330272,0.99082568807339455,null,615995.73203836847,37708.608321781336,434931.4338677061,12487.041280173838,10195.58162507435,null,null,null,null,null,null,null,null,null,null,null,null,null,null,10195.58162507435,10195.58162507435,null,"Included in the Schools Formula Budget","Included in 16-19 allocation",6000,4195.5816250743501,4195.5816250743501,349.63180208952917,349.63180208952917]
[null,6914,5431,"Hugh Christie Technology College",null,20,0,22,0,21.166666666666668,0,null,16,0,7,0,null,14.72463768115942,0,6.442028985507247,0,null,208399.245522713,0,61743.493810346205,0,12762.649102349251,null,null,null,null,null,null,null,null,null,null,null,null,null,null,12762.649102349251,0,null,"Included in the Schools Formula Budget","Included in 16-19 allocation",6000,6762.6491023492508,0,563.55409186243753,0]
[null,6917,6914,"Longfield Academy",null,34,0,36,0,35.166666666666671,0,null,38,0,1,0,null,34.264957264957268,0,0.90170940170940184,0,null,461567.30092652928,0,9605.9966195074685,0,13398.292821214314,null,null,null,null,null,null,null,null,null,null,null,null,null,null,13398.292821214314,0,null,"Included in the Schools Formula Budget","Included in 16-19 allocation",6000,7398.2928212143142,0,616.52440176785956,0]
[null,6919,6917,"Dover Christ Church Academy",null,38,0,38,0,38,0,null,10,4,12,20,null,8.2608695652173907,3.3043478260869565,9.9130434782608692,16.521739130434781,null,117575.36412199447,61964.998256368068,91778.514659790322,181174.41619355889,11907.718242939784,null,null,null,null,null,null,null,null,null,null,null,null,null,null,{"$f":"AA28+AN28","v":11907.718242939784},0,null,"Included in the Schools Formula Budget","Included in 16-19 allocation",6000,5907.7182429397835,0,492.30985357831531,0]
[null,6920,6919,"The John Wallis Academy",null,4,0,3,0,3.416666666666667,0,null,0,0,2,0,null,0,0,3.416666666666667,0,null,0,0,35564.74390503738,0,10409.19333805972,null,null,null,null,null,null,null,null,null,null,null,null,null,null,10409.19333805972,0,null,"Included in the Schools Formula Budget","Included in 16-19 allocation",6000,4409.1933380597202,0,367.43277817164335,0]
[null,"5426A",6920,"Wilmington Academy",null,3,0,10,0,7.0833333333333339,0,null,11,0,0,0,null,7.0833333333333339,0,0,0,null,101029.53370986809,0,0,0,14262.992994334318,null,null,null,null,null,null,null,null,null,null,null,null,null,null,14262.992994334318,0,null,"Included in the Schools Formula Budget","Included in 16-19 allocation",6000,8262.9929943343177,0,688.58274952785985,0]
[null,"5426B",5426,"The Archbishops School VI",null,3,0,4,0,3.5833333333333335,0,null,0,3,0,0,null,0,3.5833333333333335,0,0,null,0,66436.823767048263,0,0,18540.508958246028,null,null,null,null,null,null,null,null,null,null,null,null,null,null,18540.508958246028,0,null,"Included in the Schools Formula Budget","Included in 16-19 allocation",6000,12540.508958246028,0,1045.0424131871689,0]
[null,"6910A",5426,"The Archbishops School SPLD",null,8,0,6,0,6.8333333333333339,0,null,1,0,3,0,null,1.7083333333333335,0,5.125,0,null,24858.348326105443,0,50347.115857556069,0,11005.677685413877,null,null,null,null,null,null,null,null,null,null,null,null,null,null,11005.677685413877,0,null,"Included in the Schools Formula Budget","Included in 16-19 allocation",6000,5005.677685413877,0,417.13980711782307,0]
[null,"6910B",6910,"Leigh Academy",null,3,0,4,0,3.5833333333333335,0,null,0,3,0,0,null,0,3.5833333333333335,0,0,null,0,66436.823767048263,0,0,18540.508958246028,null,null,null,null,null,null,null,null,null,null,null,null,null,null,18540.508958246028,0,null,"Included in the Schools Formula Budget","Included in 16-19 allocation",6000,12540.508958246028,0,1045.0424131871689,0]
[null,"A2007",6910,"Leigh Academy Language Unit",null,9,0,10,0,9.5833333333333339,0,null,0,0,12,0,null,0,0,9.5833333333333339,0,null,0,0,88925.501197056074,0,9279.1827336058504,null,null,null,null,null,null,null,null,null,null,null,null,null,null,9279.1827336058504,0,null,"Included in the Schools Formula Budget","Included in 16-19 allocation",6000,3279.1827336058504,0,273.26522780048754,0]
[null,"A2029",2007,"Molehill Copse Primary Academy",null,4,0,4,0,4,0,null,0,2,0,0,null,0,4,0,0,null,0,73115.524205077134,0,0,18278.881051269283,null,null,null,null,null,null,null,null,null,null,null,null,null,null,18278.881051269283,0,null,"Included in the Schools Formula Budget","Included in 16-19 allocation",6000,12278.881051269283,0,1023.2400876057736,0]
[null,"A2034",2029,"Tymberwood Academy",null,3,0,4,0,3.5833333333333335,0,null,0,4,0,0,null,0,3.5833333333333335,0,0,null,0,66436.823767048263,0,0,18540.508958246028,null,null,null,null,null,null,null,null,null,null,null,null,null,null,18540.508958246028,0,null,"Included in the Schools Formula Budget","Included in 16-19 allocation",6000,12540.508958246028,0,1045.0424131871689,0]
[null,"A2036",2034,"Thistle Hill Academy",null,4,0,8,0,6.3333333333333339,0,null,0,0,2,0,null,0,0,6.3333333333333339,0,null,0,0,60802.939921532714,0,9600.464198136744,null,null,null,null,null,null,null,null,null,null,null,null,null,null,9600.464198136744,0,null,"Included in the Schools Formula Budget","Included in 16-19 allocation",6000,3600.464198136744,0,{"$f":"AV37/12","v":300.038683178062},0]
[null,"A2037",2036,"Valley Invicta Primary School at Leybourne Chase",null,1,0,4,0,2.75,0,null,0,0,1,0,null,0,0,2.75,0,null,0,0,29296.013386981303,0,10653.095777084111,null,null,null,null,null,null,null,null,null,null,null,null,null,null,10653.095777084111,0,null,"Included in the Schools Formula Budget","Included in 16-19 allocation",6000,4653.0957770841105,0,387.75798142367586,0]
[null,"A2038",2037,"Valley Invicta Primary School at Holborough Lakes",null,8,0,5,0,6.25,0,null,0,0,5,0,null,0,0,6.25,0,null,0,0,60081.848606775697,0,9613.0957770841123,null,null,null,null,null,null,null,null,null,null,null,null,null,null,9613.0957770841123,0,null,"Included in the Schools Formula Budget","Included in 16-19 allocation",6000,3613.0957770841123,0,301.09131475700934,0]
[null,"A2039",2038,"Valley Invicta Primary School at Kings Hill",null,8,0,10,0,9.1666666666666679,0,null,8,0,0,0,null,9.1666666666666679,0,0,0,null,130302.92597747635,0,0,0,14214.864652088327,null,null,null,null,null,null,null,null,null,null,null,null,null,null,14214.864652088327,0,null,"Included in the Schools Formula Budget","Included in 16-19 allocation",6000,8214.8646520883267,0,684.57205434069385,0]
[null,"A2048",2039,"Martello Grove Academy",null,4,0,3,0,3.416666666666667,0,null,0,0,3,0,null,0,0,3.416666666666667,0,null,0,0,35564.74390503738,0,10409.19333805972,null,null,null,null,null,null,null,null,null,null,null,null,null,null,10409.19333805972,0,null,"Included in the Schools Formula Budget","Included in 16-19 allocation",6000,4409.1933380597202,0,367.43277817164335,0]
[null,"A2061",2048,"Reculver CofE Primary School",null,9,0,7,0,7.8333333333333339,0,null,1,3,1,3,null,0.97916666666666674,2.9375,0.97916666666666674,2.9375,null,14248.077699109217,55897.338088103519,10431.156281728192,37020.319721256114,15012.369164706006,null,null,null,null,null,null,null,null,null,null,null,null,null,null,15012.369164706006,0,null,"Included in the Schools Formula Budget","Included in 16-19 allocation",6000,9012.3691647060059,0,751.03076372550049,0]
[null,"A2073",2061,"Finberry Park Primary School",null,8,0,8,0,8,0,null,0,0,3,0,null,0,0,8,0,null,0,0,75224.766216672899,0,9403.0957770841123,null,null,null,null,null,null,null,null,null,null,null,null,null,null,9403.0957770841123,0,null,"Included in the Schools Formula Budget","Included in 16-19 allocation",6000,3403.0957770841123,0,283.59131475700934,0]
[null,"A2076",2073,"Langley Park Primary Academy",null,8,0,11,0,9.75,0,null,7,0,1,0,null,8.53125,0,1.21875,0,null,121374.54133585581,0,12983.46047832126,0,13780.307878377136,null,null,null,null,null,null,null,null,null,null,null,null,null,null,13780.307878377136,0,null,"Included in the Schools Formula Budget","Included in 16-19 allocation",6000,7780.3078783771361,0,648.35898986476138,0]
[null,"A2087",2076,"Cherry Orchard Academy",null,8,0,12,0,10.333333333333334,0,null,1,0,8,0,null,1.1481481481481481,0,9.1851851851851851,0,null,16706.965812667069,0,85480.287137661478,0,9889.088995193084,null,null,null,null,null,null,null,null,null,null,null,null,null,null,9889.088995193084,0,null,"Included in the Schools Formula Budget","Included in 16-19 allocation",6000,3889.088995193084,0,324.09074959942365,0]
[null,"A2463",2087,"Morehall Academy",null,3,0,4,0,3.5833333333333335,0,null,0,2,0,0,null,0,3.5833333333333335,0,0,null,0,66436.823767048263,0,0,18540.508958246028,null,null,null,null,null,null,null,null,null,null,null,null,null,null,18540.508958246028,0,null,"Included in the Schools Formula Budget","Included in 16-19 allocation",6000,12540.508958246028,0,1045.0424131871689,0]
[null,"A2513",2463,"Minterne Community Junior School",null,24,0,24,0,24,0,null,0,0,30,0,null,0,0,24,0,null,0,0,205674.2986500187,0,8569.7624437507784,null,null,null,null,null,null,null,null,null,null,null,null,null,null,8569.7624437507784,0,null,"Included in the Schools Formula Budget","Included in 16-19 allocation",6000,2569.7624437507784,0,214.14687031256486,0]
[null,"A2654",2513,"The Oaks Community Infant School",null,12,0,12,0,12,0,null,1,0,6,0,null,1.7142857142857142,0,10.285714285714285,0,null,24944.962780203365,0,95003.270850008004,0,9995.6861358509486,null,null,null,null,null,null,null,null,null,null,null,null,null,null,9995.6861358509486,0,null,"Included in the Schools Formula Budget","Included in 16-19 allocation",6000,3995.6861358509486,0,332.97384465424574,0]
[null,"A3086",2654,"Canterbury Primary School",null,12,0,12,0,12,0,null,13,0,0,0,null,12,0,0,0,null,170114.73946142357,0,0,0,14176.228288451965,null,null,null,null,null,null,null,null,null,null,null,null,null,null,14176.228288451965,0,null,"Included in the Schools Formula Budget","Included in 16-19 allocation",6000,8176.2282884519645,0,681.35235737099708,0]
[null,"A3914",3086,"West Malling Church Of England Academy Trust",null,18,0,18,0,18,0,null,0,0,18,0,null,0,0,18,0,null,0,0,161755.72398751401,0,8986.4291104174445,null,null,null,null,null,null,null,null,null,null,null,null,null,null,8986.4291104174445,0,null,"Included in the Schools Formula Budget","Included in 16-19 allocation",6000,2986.4291104174445,0,248.86909253478703,0]
[null,"A4000",3914,"Oakfield Primary Academy",null,14,0,14,0,14.000000000000002,0,null,12,0,2,0,null,12,0,2,0,null,170114.73946142357,0,21306.191554168221,0,13672.923643970842,null,null,null,null,null,null,null,null,null,null,null,null,null,null,13672.923643970842,0,null,"Included in the Schools Formula Budget","Included in 16-19 allocation",6000,7672.923643970842,0,639.41030366423684,0]
[null,"A4002A",4000,"St Augustine Academy",null,10,0,12,0,11.166666666666668,0,null,13,0,1,0,null,10.36904761904762,0,0.79761904761904767,0,null,147197.85522906741,0,8497.1121079123277,0,13942.832895848931,null,null,null,null,null,null,null,null,null,null,null,null,null,null,13942.832895848931,0,null,"Included in the Schools Formula Budget","Included in 16-19 allocation",6000,7942.832895848931,0,661.90274132074421,0]
[null,"A4002B",4002,"Sittingbourne Academy SPLD",null,18,0,30,0,25,0,null,2,0,40,0,null,1.1904761904761905,0,23.809523809523807,0,null,17322.890819585671,0,204407.04231152646,0,8869.1973252444859,null,null,null,null,null,null,null,null,null,null,null,null,null,null,8869.1973252444859,0,null,"Included in the Schools Formula Budget","Included in 16-19 allocation",6000,2869.1973252444859,0,239.09977710370717,0]
[null,"A4004",4002,"Sittingbourne Academy HI",null,28,0,25,0,26.25,0,null,0,26,0,0,null,0,26.25,0,0,null,0,423508.12759581872,0,0,16133.64295603119,null,null,null,null,null,null,null,null,null,null,null,null,null,null,16133.64295603119,0,null,"Included in the Schools Formula Budget","Included in 16-19 allocation",6000,10133.64295603119,0,844.47024633593253,0]
[null,"A4016",4004,"Meopham School",null,15,0,15,0,15,0,null,16,0,0,0,null,15,0,0,0,null,212268.42432677947,0,0,0,14151.228288451965,null,null,null,null,null,null,null,null,null,null,null,null,null,null,14151.228288451965,0,null,"Included in the Schools Formula Budget","Included in 16-19 allocation",6000,8151.2282884519645,0,679.26902403766371,0]
[null,"A4018",4016,"The Charles Dickens School",null,4,0,4,0,4,0,null,0,6,0,0,null,0,4,0,0,null,0,73115.524205077134,0,0,18278.881051269283,null,null,null,null,null,null,null,null,null,null,null,null,null,null,18278.881051269283,0,null,"Included in the Schools Formula Budget","Included in 16-19 allocation",6000,12278.881051269283,0,1023.2400876057736,0]
[null,"A4172",4018,"The Goodwin Academy",null,13,0,13,0,13,0,null,2,0,12,0,null,1.857142857142857,0,11.142857142857142,0,null,27023.709678553645,0,102420.21008750866,0,9957.2245973894078,null,null,null,null,null,null,null,null,null,null,null,null,null,null,9957.2245973894078,0,null,"Included in the Schools Formula Budget","Included in 16-19 allocation",6000,3957.2245973894078,0,329.76871644911733,0]
[null,"A4242",4172,"Hartsdown Technology College",null,4,0,4,0,4,0,null,0,1,1,0,null,0,2,2,0,null,0,38057.762102538567,21306.191554168221,0,14840.988414176696,null,null,null,null,null,null,null,null,null,null,null,null,null,null,14840.988414176696,0,null,"Included in the Schools Formula Budget","Included in 16-19 allocation",6000,8840.9884141766961,0,736.74903451472471,0]
[null,"A5421",4242,"The Abbey School",null,30,0,30,0,30,0,null,31,0,2,0,null,28.181818181818183,0,1.8181818181818183,0,null,385216.43358364626,0,19369.265049243841,0,13486.18995442967,null,null,null,null,null,null,null,null,null,null,null,null,null,null,13486.18995442967,0,null,"Included in the Schools Formula Budget","Included in 16-19 allocation",6000,7486.1899544296703,0,623.84916286913915,0]
[null,"A5434A",5421,"The Canterbury High School",null,25,0,25,0,25,0,null,0,0,21,0,null,0,0,25,0,null,0,0,212327.39442710282,0,8493.0957770841123,null,null,null,null,null,null,null,null,null,null,null,null,null,null,8493.0957770841123,0,null,"Included in the Schools Formula Budget","Included in 16-19 allocation",6000,2493.0957770841123,0,207.75798142367603,0]
[null,"A5434B",5434,"The Westlands Academy PD",null,6,0,6,0,6,0,null,0,10,0,0,null,0,6,0,0,null,0,105173.28630761569,0,0,17528.881051269283,null,null,null,null,null,null,null,null,null,null,null,null,null,null,17528.881051269283,0,null,"Included in the Schools Formula Budget","Included in 16-19 allocation",6000,11528.881051269283,0,960.74008760577362,0]
[null,"A5435",5434,"The Westlands Academy SPLD",null,18,10,20,0,19.166666666666668,3.333333333333333,null,3,0,15,2,null,3.375,0,16.875,2.25,null,48922.895473525379,0,152020.9912382944,28355.989573728089,10191.105612691017,null,null,null,null,null,null,null,null,null,null,null,null,null,null,10191.105612691017,10191.105612691017,null,"Included in the Schools Formula Budget","Included in 16-19 allocation",6000,4191.1056126910171,{"$f":"IF(AQ62-AU62<0,0,AQ62-AU62)","v":4191.1056126910171},349.25880105758478,349.25880105758478]
[null,"A5446",5435,"St Gregory's Catholic Comprehensive School",null,10,0,9,0,9.4166666666666679,0,null,0,7,0,0,null,0,9.4166666666666679,0,0,null,0,159938.62989945244,0,0,16984.633263658663,null,null,null,null,null,null,null,null,null,null,null,null,null,null,16984.633263658663,0,null,"Included in the Schools Formula Budget","Included in 16-19 allocation",6000,10984.633263658663,0,{"$f":"AV63/12","v":915.38610530488859},0]
[null,null,5446,"St Anselm's Catholic School PD",null,10,0,10,0,10,0,null,0,13,0,0,null,0,10,0,0,null,0,169288.81051269284,0,0,16928.881051269283,null,null,null,null,null,null,null,null,null,null,null,null,null,null,16928.881051269283,0,null,"Included in the Schools Formula Budget","Included in 16-19 allocation",6000,10928.881051269283,0,910.74008760577362,0]
[null,null,5446,"St Anselm's Catholic School ASD",null,0,0,8,0,8,0,null,0,0,0,0,null,8,0,0,0,null,113909.8263076157,0,0,0,14238.728288451963,null,null,null,null,null,null,null,null,null,null,null,null,null,null,14238.728288451963,0,null,"Included in the Schools Formula Budget","Included in 16-19 allocation",6000,8238.7282884519627,0,686.56069070433023,0]
[null,null,2657,"Temple Hill",null,4,0,4,0,4,0,null,0,0,4,0,null,0,0,4,0,null,0,0,40612.383108336442,0,10153.095777084111,null,null,null,null,null,null,null,null,null,null,null,null,null,null,10153.095777084111,0,null,"Included in the Schools Formula Budget","Included in 16-19 allocation",6000,4153.0957770841105,0,346.09131475700923,0]
[null,null,6909,"The Marsh Academy",null,8,0,12,0,10.333333333333334,0,null,3,0,1,0,null,7.75,0,2.5833333333333335,0,null,110397.01923550272,0,27520.497424133955,0,13346.856450932582,null,null,null,null,null,null,null,null,null,null,null,null,null,null,13346.856450932582,0,null,"Included in the Schools Formula Budget","Included in 16-19 allocation",6000,7346.8564509325824,0,612.2380375777152,0]
[null,null,2674,"Kings Farm Primary School",null,0,0,6,0,6,0,null,0,0,0,0,null,6,0,0,0,null,85807.369730711784,0,0,0,14301.228288451965,null,null,null,null,null,null,null,null,null,null,null,null,null,null,14301.228288451965,0,null,"Included in the Schools Formula Budget","Included in 16-19 allocation",6000,8301.2282884519645,0,691.76902403766371,0]
[null,null,4031,"Orchards Academy",null,0,0,6,0,6,0,null,0,0,0,0,null,6,0,0,0,null,85807.369730711784,0,0,0,14301.228288451965,null,null,null,null,null,null,null,null,null,null,null,null,null,null,14301.228288451965,0,null,"Included in the Schools Formula Budget","Included in 16-19 allocation",6000,8301.2282884519645,0,691.76902403766371,0]
[null,null,3299,"The John Wesley CofE Methodist Voluntary Aided Primary School",null,0,0,6,0,6,0,null,0,0,0,0,null,0,0,6,0,null,0,0,57918.574662504667,0,9653.0957770841105,null,null,null,null,null,null,null,null,null,null,null,null,null,null,9653.0957770841105,0,null,"Included in the Schools Formula Budget","Included in 16-19 allocation",6000,{"$f":"AP70-AU70","v":3653.0957770841105},0,304.42464809034254,0]
[null,null,4622,"The Judd School",null,0,0,5,0,5,0,null,0,0,0,0,null,5,0,0,0,null,71756.141442259817,0,0,0,{"$f":"SUM(W71:Z71)/SUM(R71:U71)","v":14351.228288451963},null,null,null,null,null,null,null,null,null,null,null,null,null,null,{"$f":"AA71+AN71","v":14351.228288451963},{"$f":"IF(K71>0,AA71,0)","v":0},null,"Included in the Schools Formula Budget","Included in 16-19 allocation",6000,8351.2282884519627,{"$f":"IF(AQ71-AU71<0,0,AQ71-AU71)","v":0},695.93569070433023,0]
[null,null,2172,"Valley Invicta Primary School at East Borough",null,0,0,6,0,6,0,null,0,0,0,0,null,6,0,0,0,null,85807.369730711784,0,0,0,14301.228288451965,null,null,null,null,null,null,null,null,null,null,null,null,null,null,14301.228288451965,0,null,"Included in the Schools Formula Budget","Included in 16-19 allocation",6000,{"$f":"AP72-AU72","v":8301.2282884519645},0,691.76902403766371,0]