{"text_format":"1","workbook":"xlsx","n_sheets":3,"sheets":["Special Rates 2021-22","DATA","Firing Range"],"not_rendered":{"charts":0,"images":1,"macros":1,"external_links":0,"defined_names":57,"comments":0,"pivot_tables":0},"unopened":[],"bounds":{"document_bytes":16777216,"sheet_cells":100000,"rows_first":2000,"rows_last":500,"rows_between":2000,"halvings":0,"cell_chars":16384,"cell_head_chars":4096},"cells_cut":0,"cells_raw":0,"read":"whole","date_system":"1900"}

{"sheet":"Special Rates 2021-22","index":0,"n_rows":142,"n_cols":19,"rows_kept":142,"cut":false,"hidden":false,"merged":[]}
[]
[]
[]
[null,null,null,null,"2021/22 Calculation of Special School Funding Rates"]
[]
[]
[]
[null,"DfE",null,null,{"$f":"IFERROR(VLOOKUP(DFENUM,DATA!B5:C28,2,0),\"\")","v":""}]
[]
[]
[null,"Section 1 - Commissioned Place numbers"]
[]
[null,"Academic Year","Pre-16","Post-16","Weekday Residential","Weekend Residential",null,"High Needs Place numbers as agreed annually with the Local Authority's SEN team\n\n"]
[]
[null,"2020/21",{"$f":"IFERROR(VLOOKUP(DFENUM,DATA!B5:K28,3,0),0)","v":0},{"$f":"IFERROR(VLOOKUP(DFENUM,DATA!B5:K28,5,0),0)","v":0},{"$f":"IFERROR(VLOOKUP(DFENUM,DATA!B5:K28,7,0),0)","v":0},{"$f":"IFERROR(VLOOKUP(DFENUM,DATA!B5:K28,9,0),0)","v":0},null,"Place numbers 2020-21 agreed November 2019"]
[]
[null,"2021/22",{"$f":"IFERROR(VLOOKUP(DFENUM,DATA!B5:K28,4,0),0)","v":0},{"$f":"IFERROR(VLOOKUP(DFENUM,DATA!B5:K28,6,0),0)","v":0},{"$f":"IFERROR(VLOOKUP(DFENUM,DATA!B5:K28,8,0),0)","v":0},{"$f":"IFERROR(VLOOKUP(DFENUM,DATA!B5:K28,10,0),0)","v":0},null,"Place numbers 2021-22 agreed November 2020"]
[]
[null,"Movement",{"$f":"C17-C15","v":0},{"$f":"D17-D15","v":0},{"$f":"E17-E15","v":0},{"$f":"F17-F15","v":0}]
[]
{"$rows_left_out":123}
{"sheet":"DATA","index":1,"n_rows":28,"n_cols":85,"rows_kept":28,"cut":false,"hidden":true,"merged":[[2,29,2,36],[2,14,2,16],[2,17,2,19],[2,20,2,22],[1,11,1,25],[2,23,2,25],[2,11,2,13],[1,3,1,10],[2,3,2,4],[2,5,2,6],[2,7,2,8],[2,9,2,10],[2,58,2,59],[2,60,2,61],[1,47,1,55],[2,47,2,49],[2,50,2,52],[2,53,2,55],[2,56,2,57],[1,63,1,73],[2,63,2,67],[2,69,2,73],[1,74,1,84],[2,74,2,78],[2,80,2,84]]}
[null,1,2,3,4,5,6,7,8,9,10,11,12,13,14,15,16,17,18,19,20,21,22,23,24,25,26,27,28,29,30,31,32,33,34,35,36,37,38,39,40,41,42,43,44,45,46,47,48,49,50,51,52,53,54,55,56,57,58,59,60,61,62,63,64,65,66,67,68,69,70,71,72,73,74,75,76,77,78,79,80,81,82,83,84]
[null,null,null,"Places",null,null,null,null,null,null,null,"Rates",null,null,null,null,null,null,null,null,null,null,null,null,null,null,null,null,null,null,null,null,null,null,null,null,null,null,null,null,null,null,null,null,null,null,null,"Residential Rates",null,null,null,null,null,null,null,null,null,null,null,null,null,null,null,"2020/21 Financial Year",null,null,null,null,null,null,null,null,null,null,"2021/22 Financial Year"]
[null,null,null,"Pre-16",null,"Post-16",null,"Weekday",null,"Weekend",null,"MLD & SLCN",null,null,"ASD",null,null,"SEMH",null,null,"SLD",null,null,"PD & PMLD",null,null,null,null,null,"London Fringe",null,null,null,null,null,null,null,null,null,null,null,null,null,null,null,null,null,"ASD Weekday",null,null,"PD Weekday",null,null,"PD Weekend",null,null,"Residential Winter Rates",null,"Residential Pupil Fringe",null,"Residential School Fringe",null,null,"Pupil Led",null,null,null,null,"School","MFG",null,null,null,null,"Pupil Led",null,null,null,null,"School","MFG"]
[null,"DFE","School","20/21","21/22","20/21","21/22","20/21","21/22","20/21","21/22","Summer","Winter","Old Financial Year","Summer","Winter","Old Financial Year","Summer","Winter","Old Financial Year","Summer","Winter","Old Financial Year","Summer","Winter","Old Financial Year",null,"ASD Rate","SEMH Rate","MLD & SLCN","SEMH","SLD","PD & PMLD","ASD","Residential weekdayASD","Residential weekdayPD & PMLD","Residential WeekendPD & PMLD","Gross Day Floor Area","Residential floor area weekday","Residential floor area weekend","Grounds site area","Rentals","Hydrotherapy Pool","No of FSM","London Fringe","Split  site- Band  1","Split site - Band 2","Summer","Last Financial Year","Winter","Summer","Last Financial Year","Winter","Summer","Last Financial Year","Winter","Weekday","Weekend","Weekday","Weekend","Weekday","Weekend","Nursery FTE","MLD&SLCN","SEMH","SLD","PD&PMLD","ASD","All","MLD&SLCN","SEMH","SLD","PD&PMLD","ASD","MLD&SLCN","SEMH","SLD","PD&PMLD","ASD","All","MLD&SLCN","SEMH","SLD","PD&PMLD","ASD"]
[null,7002,"Broomhill Bank School",218,218,100,100,23,23,0,0,12407.498397077656,12451.117273294147,14529.83,19447.384874437168,19491.003750653661,20545.71,18658.901795131274,18702.520671347767,15687.060000000001,16575.274657335955,16618.893533552447,18083.41,23520.822160430831,23564.441036647324,24009.61,null,16504.906752666462,15744.490719770669,43.290266986246721,58.358166944889987,67.836050667038776,108.71575188339635,86.425213354992252,942.1406202545985,0,0,11140.8930014898,632.10699851023674,0,10.685,0,0,0.24873096446700502,1,0,1,57307.841383929161,59779.4,57351.46026014565,0,0,0,0,0,0,26464.596013306229,0,942.1406202545985,0,12.983247169811321,0,{"$error":"#VALUE!"},9530.7054991678488,11533.661206638648,13577.090217865225,20320.340220869966,16365.546739322719,2859.3070092525231,2139.818686766479,1294.0896899526197,1647.0159532279358,829.96121929953733,1320.8519657689576,9821.2122365475407,16072.615634601159,13988.98849680584,20934.53599990072,16861.098713907057,2611.730504989735,2096.8872584627225,0,1482.6909982044235,463.3434951095478,1072.8807811032093]
[null,7005,"Aspire School",32,88,0,0,0,0,0,0,12851.453308560915,12851.453308560915,12406.19,19848.204839551687,19848.204839551687,19199.190000000002,19087.788806655888,19087.788806655888,14395.189999999999,16994.683785138419,16994.683785138419,16429.189999999999,23899.351587016947,23899.351587016947,23132.190000000002,null,16504.906752666462,15744.490719770669,0,0,0,0,0,0,0,0,3227,0,0,1.7432000000000001,0,0,0.33333333333333298,0,0,0,0,0,0,0,0,0,0,0,0,0,0,0,0,0,0,{"$error":"#VALUE!"},0,0,0,0,0,0,0,0,0,0,0,9777.9219695612937,16014.257467656269,13921.1524461388,20825.820248017328,16774.673500552064,3073.5313389996213,0,0,0,0,0]
[null,7006,"Snowfields Academy",60,96,0,0,0,0,0,0,12890.696882526703,12890.696882526703,12450.83,19887.448413517475,19887.448413517475,19243.830000000002,19127.032380621677,19127.032380621677,14439.83,17033.927359104207,17033.927359104207,16473.830000000002,23938.595160982735,23938.595160982735,23176.83,null,16504.906752666462,15744.490719770669,0,0,0,0,0,0,0,0,3480,0,0,1.383,0,0,0.31818181818181801,0,0,0,0,0,0,0,0,0,0,0,0,0,0,0,0,0,0,{"$error":"#VALUE!"},0,0,0,0,0,0,0,0,0,0,0,9777.9219695612937,16014.257467656269,13921.1524461388,20825.820248017328,16774.673500552064,3112.7749129654094,0,0,0,0,0]
[null,7021,"Valence School",72,80,33,31,46,46,18,18,16737.704764452399,16329.008899149521,16230.93,23101.377197551417,22692.68133224854,22409.25,23023.462974411723,22614.767109108849,18267.239999999998,20961.4454115029,20552.749546200026,20331.650000000001,28000.198633371074,27591.502768068203,27165.39,null,15744.490719770669,15744.490719770669,165.5509854180452,214.97369728239582,246.06115589104323,380.14657588069474,292.88792042209087,0,1218.4285723174685,1725.6130497931049,8799,0,1924,18.321999999999999,0,1,0.20481927710843401,1,0,0,0,0,0,77658.059505344791,75376.91,77249.36364004192,104490.68033580808,101427.99,104081.98447050519,40644.813337983695,25586.308352987642,1218.4285723174685,1725.6130497931049,37.195248648648651,37.195248648648651,{"$error":"#VALUE!"},9653.8572378440185,11690.167131631039,13754.576312650333,20588.317304755357,15832.179988425592,6577.0728343525152,0,0,0,0,0,9943.4729549793392,16229.231164938665,14167.213602029846,21205.966823898019,16307.145388078361,6555.8258880463809,0,0,0,0,0]
[null,7032,"Bower Grove School",214,225,0,0,0,0,0,0,12419.078230834317,12336.923883103813,12050.22,18655.413728929292,18573.25938119879,18104.919999999998,18655.413728929292,18573.25938119879,14446.49,16562.308707411823,16480.154359681321,16072.779999999999,23466.976509290347,23384.822161559845,22776.34,null,15744.490719770669,15744.490719770669,0,0,0,0,0,0,0,0,4093,0,0,2.1496,0,0,0.51327433628318597,0,1,0,0,0,0,0,0,0,0,0,0,0,0,0,0,0,0,{"$error":"#VALUE!"},9493.1281257876635,11889.394549857825,13515.681986542524,20219.24295924012,15547.822784132299,2557.0931364904786,0,0,0,0,0,9777.9219695612937,16014.257467656269,13921.1524461388,20825.820248017328,16014.257467656269,2593.2328917635623,0,0,0,0,0]
[null,7033,"St Anthony's School",98,98,0,0,0,0,0,0,15151.345840562875,15195.73504075963,14706.98,21387.681338657851,21432.070538854605,20761.669999999998,21387.681338657851,21432.070538854605,17037.88,19294.576317140381,19338.965517337136,18729.53,26199.244119018906,26243.63331921566,25433.09,null,15744.490719770669,15744.490719770669,0,0,0,0,0,0,0,0,3614,0,0,1.54,0,0,0.62616822429906493,0,0,0,0,0,0,0,0,0,0,0,0,0,0,0,0,0,0,{"$error":"#VALUE!"},9493.1281257876635,11824.034416519175,13515.681986542524,20219.24295924012,15547.822784132299,5213.8490469296257,0,0,0,0,0,9777.9219695612937,16014.257467656269,13921.1524461388,20825.820248017328,16014.257467656269,5399.3175711163549,0,0,0,0,0]
[null,7039,"The Ifield School",210,212,40,37,0,0,0,0,12216.329440395928,12416.444635586198,11853.76,19213.080971386698,19413.196166576967,18646.72,18452.664938490903,18652.780133681172,13842.09,16359.559916973434,16559.675112163703,15876.310000000001,23264.227718851958,23464.342914042227,22579.879999999997,null,16504.906752666462,15744.490719770669,0,0,0,0,0,0,0,0,4274.1399960000008,0,0,6.22,75000,1,0.37755102040816296,0,1,0,0,0,0,0,0,0,0,0,0,0,0,0,0,0,0,{"$error":"#VALUE!"},9493.1281257876635,11481.454804172401,13515.681986542524,20219.24295924012,16286.090777235015,2360.6329471214094,0,0,0,0,0,9777.9219695612937,16014.257467656269,13921.1524461388,20825.820248017328,16774.673500552064,2555.1413346956242,0,0,0,0,0]
[null,7040,"Foreland Fields School",188,191,32,33,0,0,0,0,12377.453881422296,12366.862997208646,12016.33,19374.205412413066,19363.614528199418,18809.29,18613.789379517271,18603.198495303623,14004.66,16520.684357999802,16510.093473786153,16038.89,23425.352159878326,23414.761275664678,22742.45,null,16504.906752666462,15744.490719770669,0,0,0,0,0,0,0,0,4331,0,0,4.3045,0,1,0.40223463687150796,0,1,0,0,0,0,0,0,0,0,0,0,0,0,0,0,0,0,{"$error":"#VALUE!"},9493.1281257876635,11481.454804172401,13515.681986542524,20219.24295924012,16286.090777235015,2523.203923619601,0,0,0,0,0,9777.9219695612937,16014.257467656269,13921.1524461388,20825.820248017328,16774.673500552064,2593.3538960697074,0,0,0,0,0]
[null,7041,"Goldwyn School",150,156,0,33,0,0,0,0,14045.826719112833,13564.823179731447,14106.03,20282.162217207806,19801.158677826421,19682.07,20282.162217207806,19801.158677826421,18665.47,18189.057195690337,17708.053656308952,17649.93,25093.724997568861,24612.721458187476,24353.49,null,15744.490719770669,15744.490719770669,0,0,0,0,0,0,0,0,5856.3800899999997,0,0,7.3492000000000006,47900,0,0.41666666666666702,0,2,1,0,0,0,0,0,0,0,0,0,0,0,0,0,0,0,{"$error":"#VALUE!"},9493.1281257876635,14531.230789142326,13515.681986542524,20219.24295924012,15547.822784132299,4134.2432730276996,478.66186751871101,0,0,0,0,9777.9219695612937,16014.257467656269,13921.1524461388,20825.820248017328,16014.257467656269,3987.3193515790636,340.78867885964246,0,0,0,0]
[null,7043,"The Beacon Folkestone",348,329,64,73,0,0,0,0,11612.130365690771,11684.064947701736,11771.35,18608.881896681545,18680.816478692508,18016.080000000002,17848.465863785746,17920.400445796713,13531.6,15755.360842268277,15827.295424279244,15381.77,22660.028644146805,22731.963226157768,21949.23,null,16504.906752666462,15744.490719770669,0,0,0,0,0,0,0,0,7676,0,0,2.4561000000000002,0,1,0.47292418772563205,0,0,1,0,0,0,0,0,0,0,0,0,0,0,0,0,0,0,{"$error":"#VALUE!"},9493.1281257876635,11481.454804172401,13515.681986542524,20219.24295924012,16286.090777235015,1729.987309816119,548.23936220883661,320.1551582524462,136.09636737367873,0,0,9777.9219695612937,16014.257467656269,13921.1524461388,20825.820248017328,16774.673500552064,1876.1702356358746,117.257794802832,0,0,0,0]
[null,7044,"Rowhill School",110,132,0,0,0,0,0,0,14966.877807014556,14165.957203875618,14536.1,21330.550240113575,20529.629636974641,20714.419999999998,21260.681507406785,20459.760904267845,16972.64,19190.618454065061,18389.697850926124,18636.82,26229.371675933238,25428.451072794298,25470.559999999998,null,15744.490719770669,15744.490719770669,165.55098541804574,223.01918771529844,246.06115589104374,380.1465758806952,292.8879204220915,0,0,0,4165,0,0,1.8948,0,0,0.53623188405797106,1,0,0,0,0,0,0,0,0,0,0,0,0,0,0,0,0,0,{"$error":"#VALUE!"},9653.8572378440185,12090.405184031722,13754.576312650333,20588.317304755357,15832.179988425592,4882.2388345846584,0,0,0,0,0,9943.4729549793392,16237.276655371568,14167.213602029846,21205.966823898019,16307.145388078361,4556.2011668708365,36.425878149824712,0,0,0,0]
[null,7045,"Elms School",158,158,0,0,0,0,0,0,13105.960914214065,13126.47689890939,13048.92,19342.296412309042,19362.812397004363,18783.41,19342.296412309042,19362.812397004363,15260.26,17249.191390791573,17269.707375486894,16858.739999999998,24153.859192670097,24174.375177365422,23440.760000000002,null,15744.490719770669,15744.490719770669,0,0,0,0,0,0,0,0,2771,0,0,2.13,0,0,0.73793103448275899,0,0,0,0,0,0,0,0,0,0,0,0,0,0,0,0,0,0,{"$error":"#VALUE!"},9493.1281257876635,11892.531692866904,13515.681986542524,20219.24295924012,15547.822784132299,3221.5171870326603,334.27197051802432,146.21494912913113,121.54075672810359,0,14.071772240218706,9777.9219695612937,16014.257467656269,13921.1524461388,20825.820248017328,16014.257467656269,3340.0066023917107,0,0,0,0,0]
[null,7051,"Nexus School",200,200,28,28,0,0,0,0,12781.181213437128,12794.938176727126,12773.08,19777.932744427897,19791.689707717898,19358.809999999998,19017.516711532102,19031.273674822103,14600.18,16924.411690014633,16938.168653304634,16588.400000000001,23829.079491893157,23842.836455183158,23291.96,null,16504.906752666462,15744.490719770669,0,0,0,0,0,0,0,0,6916,0,0,2.36,0,1,0.30246913580246898,0,0,1,0,0,0,0,0,0,0,0,0,0,0,0,0,0,0,{"$error":"#VALUE!"},9493.1281257876635,11481.454804172401,13515.681986542524,20219.24295924012,16286.090777235015,3072.714265015009,207.23455720164384,46.011136281140352,0,0,0,9777.9219695612937,16014.257467656269,13921.1524461388,20825.820248017328,16774.673500552064,3011.2841391283337,0,0,0,0,0]
[null,7052,"Grange Park School",100,91,50,53,0,0,0,0,12895.431577037925,13025.035357207142,12861.07,19892.183108028694,20021.786888197916,19294.78,19131.767075132902,19261.370855302117,14744.24,17038.662053615433,17168.265833784648,16670.89,23943.329855493954,24072.933635663176,23196.620000000003,null,16504.906752666462,15744.490719770669,0,0,0,0,0,0,0,0,1958.53,0,0,1.1245000000000001,0,0,0.27472527472527497,0,0,0,0,0,0,0,0,0,0,0,0,0,0,0,0,0,0,{"$error":"#VALUE!"},9493.1281257876635,11481.454804172401,13515.681986542524,20219.24295924012,16286.090777235015,2977.3724177598997,390.56454904473503,285.41265739939263,177.8333352548143,0,31.321331900915538,9777.9219695612937,16014.257467656269,13921.1524461388,20825.820248017328,16774.673500552064,3193.1118125753414,0,0,0,0,0]
[null,7056,"Five Acre Wood School",420,542,50,59,0,0,0,0,11389.534553589108,11089.552393427863,11254.39,18386.286084579879,18086.303924418637,17846.72,17625.870051684084,17325.887891522838,13042.08,15532.765030166614,15232.782870005369,15076.310000000001,22437.432832045139,22137.450671883897,21779.870000000003,null,16504.906752666462,15744.490719770669,0,0,0,0,0,0,0,0,7768.4,0,0,2.6381999999999999,9259,1,0.33466135458167301,0,1,1,0,0,0,0,0,0,0,0,0,0,0,0,0,0,0,{"$error":"#VALUE!"},9493.1281257876635,11481.454804172401,13515.681986542524,20219.24295924012,16286.090777235015,1560.6243133500543,200.63756086228022,0,0,0,0,9777.9219695612937,16014.257467656269,13921.1524461388,20825.820248017328,16774.673500552064,1436.6229906004219,39.84503983828472,0,0,0,0]
[null,7058,"Stone Bay School",65,69,15,21,18,18,0,0,15814.326036452789,15191.678851242625,16536.41,29654.821863505709,29032.174678295545,29561.88,22050.661534547766,21428.014349337598,18448.260000000002,19957.556513030297,19334.909327820129,20404.25,26862.224314908821,26239.577129698657,26850.62,null,23348.65104872861,15744.490719770669,0,0,0,0,0,0,0,0,2396.216342490492,1481.783657509508,0,0.96,0,1,0.45,0,0,0,77583.763841683729,76094.84,76961.116656473561,74791.166293086848,73383.58,74168.51910787668,0,0,0,32337.417395113174,0,0,0,0,0,{"$error":"#VALUE!"},9493.1281257876635,11481.454804172401,13515.681986542524,20219.24295924012,22930.502715159429,6631.3800484653948,411.90234078677349,335.42823777198282,257.18873075774172,0,0,9777.9219695612937,16014.257467656269,13921.1524461388,20825.820248017328,23618.417796614216,5673.1932088522335,1085.2948215864744,0,809.90434500896663,351.60654313044142,270.26899453355509]
{"$rows_left_out":9}
{"sheet":"Firing Range","index":2,"n_rows":54,"n_cols":50,"rows_kept":54,"cut":false,"hidden":true,"merged":[]}
[{"$f":"COUNTIF(B1:AT1,\">0\")-22","v":3},null,7032,{"$f":"COUNTIF(D2:D108,\">0\")","v":0},7033,{"$f":"COUNTIF(F2:F108,\">0\")","v":0},7044,{"$f":"COUNTIF(H2:H108,\">0\")","v":0},7045,{"$f":"COUNTIF(J2:J108,\">0\")","v":0},7062,{"$f":"COUNTIF(L2:L108,\">0\")","v":16},7041,{"$f":"COUNTIF(N2:N108,\">0\")","v":0},7067,{"$f":"COUNTIF(P2:P108,\">0\")","v":0},7021,{"$f":"COUNTIF(R2:R108,\">0\")","v":0},7002,{"$f":"COUNTIF(T2:T108,\">0\")","v":15},7052,{"$f":"COUNTIF(V2:V108,\">0\")","v":0},7058,{"$f":"COUNTIF(X2:X108,\">0\")","v":0},7073,{"$f":"COUNTIF(Z2:Z108,\">0\")","v":0},7039,{"$f":"COUNTIF(AB2:AB108,\">0\")","v":0},7040,{"$f":"COUNTIF(AD2:AD108,\">0\")","v":0},7043,{"$f":"COUNTIF(AF2:AF108,\">0\")","v":0},7051,{"$f":"COUNTIF(AH2:AH108,\">0\")","v":17},7056,{"$f":"COUNTIF(AJ2:AJ108,\">0\")","v":0},7063,{"$f":"COUNTIF(AL2:AL108,\">0\")","v":0},7066,{"$f":"COUNTIF(AN2:AN108,\">0\")","v":0},7069,{"$f":"COUNTIF(AP2:AP108,\">0\")","v":0},7070,{"$f":"COUNTIF(AR2:AR108,\">0\")","v":0},7072,{"$f":"COUNTIF(AT2:AT108,\">0\")","v":0},7005,{"$f":"COUNTIF(AV2:AV108,\">0\")","v":0},7006,{"$f":"COUNTIF(AX2:AX108,\">0\")","v":0}]
["DFENUM",{"$f":"'Special Rates 2021-22'!DFENUM","v":0},7032,{"$f":"IF(C2=C1,0,1)","v":0},7033,{"$f":"IF(E2=E1,0,1)","v":0},7044,{"$f":"IF(G2=G1,0,1)","v":0},7045,{"$f":"IF(I2=I1,0,1)","v":0},7062,{"$f":"IF(K2=K1,0,1)","v":0},7041,{"$f":"IF(M2=M1,0,1)","v":0},7067,{"$f":"IF(O2=O1,0,1)","v":0},7021,{"$f":"IF(Q2=Q1,0,1)","v":0},7002,{"$f":"IF(S2=S1,0,1)","v":0},7052,{"$f":"IF(U2=U1,0,1)","v":0},7058,{"$f":"IF(W2=W1,0,1)","v":0},7073,{"$f":"IF(Y2=Y1,0,1)","v":0},7039,{"$f":"IF(AA2=AA1,0,1)","v":0},7040,{"$f":"IF(AC2=AC1,0,1)","v":0},7043,{"$f":"IF(AE2=AE1,0,1)","v":0},7051,{"$f":"IF(AG2=AG1,0,1)","v":0},7056,{"$f":"IF(AI2=AI1,0,1)","v":0},7063,{"$f":"IF(AK2=AK1,0,1)","v":0},7066,{"$f":"IF(AM2=AM1,0,1)","v":0},7069,{"$f":"IF(AO2=AO1,0,1)","v":0},7070,{"$f":"IF(AQ2=AQ1,0,1)","v":0},7072,{"$f":"IF(AS2=AS1,0,1)","v":0},7005,{"$f":"IF(AU2=AU1,0,1)","v":0},7006,{"$f":"IF(AW2=AW1,0,1)","v":0}]
["NAME",{"$f":"[0]!NAME","v":""},"Bower Grove School",0,"St Anthony's School",0,"Rowhill School",0,"Elms School",0,"The Orchard School",0,"Goldwyn School",0,"Portal House School",0,"Valence School",0,"Broomhill Bank School",0,"Grange Park School",0,"Stone Bay School",0,"Laleham Gap School",0,"The Ifield School",0,"Foreland Fields School",0,"The Beacon Folkestone",0,"Nexus School",0,"Five Acre Wood School",0,"St Nicholas' School",0,"Milestone Academy",0,"The Wyvern School",0,"Oakley School",0,"Meadowfield School",0,"Aspire School",0,"Snowfields Academy",0]
["preold",{"$f":"[0]!preold","v":0},214,0,98,0,110,0,158,0,83,0,150,0,80,0,72,0,218,0,100,0,65,0,196,0,210,0,188,0,348,0,200,0,420,0,249,0,285,0,255,0,200,0,298,0,32,0,60,0]
["postold",{"$f":"[0]!postold","v":0},0,0,0,0,0,0,0,0,0,0,0,0,0,0,33,0,100,0,50,0,15,0,0,0,40,0,32,0,64,0,28,0,50,0,43,0,55,0,35,0,52,0,50,0,0,0,0,0]
["weekdayold",{"$f":"[0]!weekdayold","v":0},0,0,0,0,0,0,0,0,0,0,0,0,0,0,46,0,23,0,0,0,18,0,0,0,0,0,0,0,0,0,0,0,0,0,0,0,0,0,0,0,0,0,0,0,0,0,0,0]
["weekendold",{"$f":"[0]!weekendold","v":0},0,0,0,0,0,0,0,0,0,0,0,0,0,0,18,0,0,0,0,0,0,0,0,0,0,0,0,0,0,0,0,0,0,0,0,0,0,0,0,0,0,0,0,0,0,0,0,0]
["prenew",{"$f":"[0]!prenew","v":0},225,0,98,0,132,0,158,0,98,1,156,0,80,0,80,0,197,1,91,0,69,0,187,0,212,0,191,0,329,0,185,1,542,0,273,0,285,0,240,0,170,0,310,0,88,0,96,0]
["postnew",{"$f":"[0]!postnew","v":0},0,0,0,0,0,0,0,0,0,0,33,0,0,0,31,0,81,1,53,0,21,0,9,0,37,0,33,0,73,0,22,1,59,0,39,0,55,0,45,0,42,0,41,0,0,0,0,0]
["weekdaynew",{"$f":"[0]!weekdaynew","v":0},0,0,0,0,0,0,0,0,0,0,0,0,0,0,46,0,23,0,0,0,18,0,0,0,0,0,0,0,0,0,0,0,0,0,0,0,0,0,0,0,0,0,0,0,0,0,0,0]
["weekendnew",{"$f":"[0]!weekendnew","v":0},0,0,0,0,0,0,0,0,0,0,0,0,0,0,18,0,0,0,0,0,0,0,0,0,0,0,0,0,0,0,0,0,0,0,0,0,0,0,0,0,0,0,0,0,0,0,0,0]
["mldold",{"$f":"[0]!mldold","v":0},12419.078230834317,0,15151.345840562875,0,14966.877807014556,0,13105.960914214065,0,15629.409695226384,0,14045.826719112833,0,16269.834936178362,0,16737.704764452399,0,12407.498397077656,0,12895.431577037925,0,15814.326036452789,0,12744.004437721687,0,12216.329440395928,0,12377.453881422296,0,11612.130365690771,0,12781.181213437128,0,11389.534553589108,0,12649.782364494578,0,12292.942657044421,0,11991.363450798932,0,12206.714505492659,0,11700.163832152439,0,12851.453308560915,0,12890.696882526703,0]
["besdold",{"$f":"[0]!besdold","v":0},18655.413728929292,0,21387.681338657851,0,21260.681507406785,0,19342.296412309042,0,21865.74519332136,0,20282.162217207806,0,22506.170434273336,0,23023.462974411723,0,18658.901795131274,0,19131.767075132902,0,22050.661534547766,0,18980.339935816661,0,18452.664938490903,0,18613.789379517271,0,17848.465863785746,0,19017.516711532102,0,17625.870051684084,0,18886.117862589552,0,18578.700867003747,0,18227.698948893907,0,18443.050003587632,0,17936.499330247414,0,19087.788806655888,0,19127.032380621677,0]
["sldold",{"$f":"[0]!sldold","v":0},16562.308707411823,0,19294.576317140381,0,19190.618454065061,0,17249.191390791573,0,19772.640171803891,0,18189.057195690337,0,20413.065412755866,0,20961.4454115029,0,16575.274657335955,0,17038.662053615433,0,19957.556513030297,0,16887.234914299192,0,16359.559916973434,0,16520.684357999802,0,15755.360842268277,0,16924.411690014633,0,15532.765030166614,0,16793.012841072083,0,16516.683304094928,0,16134.593927376438,0,16349.944982070165,0,15843.394308729945,0,16994.683785138419,0,17033.927359104207,0]
["pdold",{"$f":"[0]!pdold","v":0},23466.976509290347,0,26199.244119018906,0,26229.371675933238,0,24153.859192670097,0,26677.307973682415,0,25093.724997568861,0,27317.733214634391,0,28000.198633371074,0,23520.822160430831,0,23943.329855493954,0,26862.224314908821,0,23791.902716177719,0,23264.227718851958,0,23425.352159878326,0,22660.028644146805,0,23829.079491893157,0,22437.432832045139,0,23697.680642950607,0,23555.436525963101,0,23039.261729254962,0,23254.612783948687,0,22748.062110608469,0,23899.351587016947,0,23938.595160982735,0]
["asdold",{"$f":"[0]!asdold","v":0},18655.413728929292,0,21387.681338657851,0,21330.550240113575,0,19342.296412309042,0,21865.74519332136,0,20282.162217207806,0,22506.170434273336,0,23101.377197551417,0,19447.384874437168,0,19892.183108028694,0,29654.821863505709,0,19740.755968712459,0,19213.080971386698,0,19374.205412413066,0,18608.881896681545,0,19777.932744427897,0,18386.286084579879,0,19646.533895485347,0,19431.176812124679,0,18988.114981789702,0,19203.466036483427,0,18696.915363143209,0,19848.204839551687,0,19887.448413517475,0]
["pdweekdayold",{"$f":"[0]!pdweekdayold","v":0},0,0,0,0,0,0,0,0,0,0,0,0,0,0,77658.059505344791,0,0,0,0,0,74791.166293086848,0,0,0,0,0,0,0,0,0,0,0,0,0,0,0,0,0,0,0,0,0,0,0,0,0,0,0]
["asdweekdayold",{"$f":"[0]!asdweekdayold","v":0},0,0,0,0,0,0,0,0,0,0,0,0,0,0,0,0,57307.841383929161,0,0,0,77583.763841683729,0,0,0,0,0,0,0,0,0,0,0,0,0,0,0,0,0,0,0,0,0,0,0,0,0,0,0]
["pdweekendold",{"$f":"[0]!pdweekendold","v":0},0,0,0,0,0,0,0,0,0,0,0,0,0,0,104490.68033580808,0,0,0,0,0,0,0,0,0,0,0,0,0,0,0,0,0,0,0,0,0,0,0,0,0,0,0,0,0,0,0,0,0]
["mldnew",{"$f":"[0]!mldnew","v":0},12336.923883103813,0,15195.73504075963,0,14165.957203875618,0,13126.47689890939,0,14808.879796593657,1,13564.823179731447,0,16277.311042968357,0,16329.008899149521,0,12813.611112712093,1,13025.035357207142,0,15191.678851242625,0,12703.303425209831,0,12416.444635586198,0,12366.862997208646,0,11684.064947701736,0,13087.371207226863,1,11089.552393427863,0,12487.165587942236,0,12289.579782520404,0,12040.424436529316,0,12652.419896234425,0,11777.396305647842,0,12851.453308560915,0,12890.696882526703,0]
{"$rows_left_out":34}