{"text_format":"1","workbook":"xlsx","n_sheets":8,"sheets":["Data","TestArea","Contents","Home","Early Years","High Needs Mainstream","Specialist Resourced Provision","SRP Rates"],"not_rendered":{"charts":0,"images":2,"macros":1,"external_links":0,"defined_names":47,"comments":1,"pivot_tables":0},"unopened":[],"bounds":{"document_bytes":16777216,"sheet_cells":100000,"rows_first":2000,"rows_last":500,"rows_between":2000,"halvings":0,"cell_chars":16384,"cell_head_chars":4096},"cells_cut":0,"cells_raw":0,"read":"whole","date_system":"1900"}

{"sheet":"Data","index":0,"n_rows":262,"n_cols":80,"rows_kept":262,"cut":false,"hidden":true,"merged":[]}
[1,2,3,4,5,6,7,8,9,10,11,12,13,14,15,16,17,18,19,20,21,22,23,24,25,26,27,28,29,30,31,32,33,34,35,36,37,38,39,40,41,42,43,44,45,46,47,48,49,50,51,52,53,54,55,56,57,58,59,60,61,62,63,64,65,66,67,68,69,70,71,72,73,74,75,76,77,78,79,80]
["final list","School Name","Phase","IDACI Primary","IDACI Secondary","IDACI Total","Ever6 FSM","Low Cost, high Incidence SEN","English as an additional language","Element of Lump Sum","London Fringe Multiplier",null,null,null,null,null,null,null,null,null,null,null,null,null,null,null,null,null,null,null,null,null,null,null,null,null,null,null,null,null,null,null,null,"Early Years - Base Rate","Early Years - QTS","Early Years - Disadvantage"]
[2001,"Horizon Primary Academy",1,63574.47099999999,0,{"$f":"D3+E3","v":63574.47099999999},31449.999599999996,42691.069741379375,1881.4589571428523,6235.0623070081465,1.0364,null,null,null,null,null,null,null,null,null,null,null,null,null,null,null,null,null,null,null,null,null,null,null,null,null,null,null,null,null,null,null,null,0,0,0]
[2003,"Oaks Primary Academy",1,48029.285604790479,0,{"$f":"D4+E4","v":48029.285604790479},23165.44584827586,42815.167043478315,3167.0040845070421,6235.0623070081465,1,null,null,null,null,null,null,null,null,null,null,null,null,null,null,null,null,null,null,null,null,null,null,null,null,null,null,null,null,null,null,null,null,4.08,0,0.22]
[2004,"Tree Tops Primary Academy",1,81807.225000000049,0,81807.225000000049,41699.317864462806,107272.4239568528,13437.899950000001,6235.0623070081465,1,null,null,null,null,null,null,null,null,null,null,null,null,null,null,null,null,null,null,null,null,null,null,null,null,null,null,null,null,null,null,null,null,4.08,0,0.67]
[2006,"St James the Great Academy",1,56839.760000000024,0,56839.760000000024,24907.62854918919,67311.356513245046,0,6235.0623070081465,1,null,null,null,null,null,null,null,null,null,null,null,null,null,null,null,null,null,null,null,null,null,null,null,null,null,null,null,null,null,null,null,null,4.08,0,0.1]
[2007,"Molehill Primary Academy",1,77043.893000000098,0,77043.893000000098,47469.592567741929,112507.36365898623,17271.042311688328,6235.0623070081465,1,null,null,null,null,null,null,null,null,null,null,null,null,null,null,null,null,null,null,null,null,null,null,null,null,null,null,null,null,null,null,null,null,0,0,0]
[2008,"Tiger Primary School",1,73057.104200000002,0,73057.104200000002,31245.799067307689,125212.98550568186,15020.146637119115,6235.0623070081465,1,null,null,null,null,null,null,null,null,null,null,null,null,null,null,null,null,null,null,null,null,null,null,null,null,null,null,null,null,null,null,null,null,0,0,0]
[2009,"Northdown Primary School",1,137271.02249999993,0,137271.02249999993,59660.751946583841,133390.34638846165,18870.959690740772,6235.0623070081465,1,null,null,null,null,null,null,null,null,null,null,null,null,null,null,null,null,null,null,null,null,null,null,null,null,null,null,null,null,null,null,null,null,4.08,0,0.73]
[2010,"Newlands Primary School",1,96447.466000000059,0,96447.466000000059,52022.44204974093,142323.7674736843,14528.594274509804,6235.0623070081465,1,null,null,null,null,null,null,null,null,null,null,null,null,null,null,null,null,null,null,null,null,null,null,null,null,null,null,null,null,null,null,null,null,0,0,0]
[2011,"Salmestone Primary School",1,107775.39000000006,0,107775.39000000006,37476.453699082565,109592.45432451909,15141.383059845555,6235.0623070081465,1,null,null,null,null,null,null,null,null,null,null,null,null,null,null,null,null,null,null,null,null,null,null,null,null,null,null,null,null,null,null,null,null,4.08,0,0.4]
[2013,"Water Meadows Primary School",1,19853.88800000001,0,19853.88800000001,12168.270867469879,29884.671760273981,1931.6890743243225,6235.0623070081465,1,null,null,null,null,null,null,null,null,null,null,null,null,null,null,null,null,null,null,null,null,null,null,null,null,null,null,null,null,null,null,null,null,0,0,0]
[2014,"St Laurence in Thanet C of E Junior Academy",1,58540.94999999999,0,58540.94999999999,34535.289013574657,73113.200856459356,1070.7489999999996,6235.0623070081465,1,null,null,null,null,null,null,null,null,null,null,null,null,null,null,null,null,null,null,null,null,null,null,null,null,null,null,null,null,null,null,null,null,0,0,0]
[2015,"Dame Janet Primary Academy",1,129940.89499999999,0,129940.89499999999,76959.32835164835,195335.48645533147,17014.641643835628,6235.0623070081465,1,null,null,null,null,null,null,null,null,null,null,null,null,null,null,null,null,null,null,null,null,null,null,null,null,null,null,null,null,null,null,null,null,4.08,0,0.52]
[2017,"Drapers Mills Primary Academy",1,200200.04199999981,0,200200.04199999981,78341.987471186425,228036.12805015664,57973.006543535579,6235.0623070081465,1,null,null,null,null,null,null,null,null,null,null,null,null,null,null,null,null,null,null,null,null,null,null,null,null,null,null,null,null,null,null,null,null,4.08,0,0.79]
{"$rows_left_out":248}
{"sheet":"TestArea","index":1,"n_rows":1,"n_cols":146,"rows_kept":1,"cut":false,"hidden":true,"merged":[]}
["MI DfE no","School Name",null,"Macro School Name","Data Calc",{"$f":"SUM(F2:F305)","v":0},null,"Macro F1","Data Calc F1",0,null,"Macro F2","Data Calc F2",0,null,"Macro F4","Data Calc F4",0,null,"Macro F6","Data Calc F6",0,null,"Macro F7","Data Calc F7",0,null,"Macro F8","Data Calc F8",0,null,"Macro F9","Data Calc F9",0,null,"Macro F10","Data Calc F10",0,null,"Macro F11","Data Calc F11",0,null,"Macro F12","Data Calc F12",0,null,"Macro F13","Data Calc F13",0,null,"Macro F14","Data Calc F14",0,null,"Macro FFT","Data Calc FFT",0,null,"Macro MFG","Data Calc MFG",0,null,"Macro SBS","Data Calc SBS",0,null,"Macro Growth","Data Calc Growth",0,null,"Macro SBS Inc Growth","Data Calc SBS Inc Growth",0,null,"Early years rate",null,{"$f":"SUM(BZ2:BZ305)","v":0},null,"Macro Notional SEN","Data Calc",{"$f":"SUM(CD2:CD305)","v":0},null,"Macro SEN top up","Data Calc",{"$f":"SUM(CH2:CH305)","v":0},null,"SRP Element 1","Data Calc",{"$f":"SUM(CL2:CL305)","v":0},null,"SRP Element 2","Data Calc",{"$f":"SUM(CP2:CP305)","v":0},null,"SRP 1 Pre","Data Calc",{"$f":"SUM(CT2:CT305)","v":0},null,"SRP 1 Post","Data Calc",{"$f":"SUM(CX2:CX305)","v":0},null,"SRP 2 Pre","Data Calc",{"$f":"SUM(DB2:DB305)","v":0},null,"SRP 2 Post","Data Calc",{"$f":"SUM(DF2:DF305)","v":0},null,"Qual Year1","Data Calc",{"$f":"SUM(DJ2:DJ305)","v":0},null,"Orig PAN 1","Data Calc",{"$f":"SUM(DN2:DN305)","v":0},null,"New PAN","Data Calc",{"$f":"SUM(DR2:DR305)","v":0},null,"Qual Year2","Data Calc",{"$f":"SUM(DV2:DV305)","v":0},null,"Orig PAN2","Data Calc",{"$f":"SUM(DZ2:DZ305)","v":0},null,"New PAN2","Data Calc",{"$f":"SUM(ED2:ED305)","v":0},null,"Qual Year3","Data Calc",{"$f":"SUM(EH2:EH305)","v":0},null,"Orig PAN3","Data Calc",{"$f":"SUM(EL2:EL305)","v":0},null,"New PAN3","Data Calc",{"$f":"SUM(EP2:EP305)","v":0}]

{"sheet":"Contents","index":2,"n_rows":7,"n_cols":2,"rows_kept":7,"cut":false,"hidden":false,"merged":[[6,1,6,11],[2,0,2,11],[4,1,4,11],[0,0,1,11],[5,1,5,11],[3,1,3,11]]}
["Contents"]
[]
["Guidance has been written to aid the user in populating this template, to access this guidance click on this link\nUser guidance"]
["Early Years","This is the input sheet to calculate your Early Years 3 & 4 years olds free entitlement, Early Years Pupil Premium and 2 Year old funding, Special Education Needs Inclusion Fund (SENIF) and Disability Access Fund (DAF). Please note that the funding rates are compliant with Dedicated School Grant Financial year that runs from April 2020 to March 2021."]
["High Needs Mainstream","The purpose of this template is to calculate your High Needs mainstream funding for 2020-21. Please note that the funding rates are compliant with Dedicated School Grant Financial year that runs from April 2020 to March 2021."]
["Specialist Resource Provision","The purpose of this template is to calculate your Specialist Resource Provision (SRP) Funding for 2020-21. We have not extended the forecast period in the same way as Early Years and Mainstream High Needs due to complications around place funding. Academies will therefore need to do their own calculations to estimate funding for the period April 2021 to August 2021."]
["SRP Rates","This tabs provides a breakdown of how the SRP rate has been calculated for each SRP."]

{"sheet":"Home","index":3,"n_rows":12,"n_cols":8,"rows_kept":12,"cut":false,"hidden":false,"merged":[[5,1,5,7]]}
[]
[null,null,null,null,null,"DfE Number"]
[]
[]
[null,null,null,null,null,null,"Phase",{"$f":"IFERROR(VLOOKUP(Year1DfE,dataslate,3,0),\"\")","v":""}]
[9,{"$f":"IF(ISERROR(VLOOKUP(Year1DfE,dataslate,2,0)),\"\",VLOOKUP(Year1DfE,dataslate,2,0))","v":""}]
[9]
[]
[]
[null,null,"The templates in this file are intended to provide a means to forecast and reconcile funding due from Kent County Council."]
[null,null,"All funding due from Kent County Council to academies is paid on the Dedicated Schools Grant financial year April 2020 to March 2021"]
[null,null,"If you have any queries about funding due from Kent County Council, please refer to the guidance documents provided on KELSI in the first instance (documents - funding guidance, input guidance)."]

{"sheet":"Early Years","index":4,"n_rows":128,"n_cols":11,"rows_kept":128,"cut":false,"hidden":false,"merged":[[4,2,4,7],[67,2,67,4],[6,0,6,10],[18,2,18,4],[10,4,10,5],[9,2,9,3],[11,4,11,5],[12,4,12,5],[13,4,13,5],[9,4,9,5],[9,6,9,7],[10,6,10,7],[11,6,11,7],[12,6,12,7],[13,6,13,7],[9,8,9,9],[10,8,10,9],[11,8,11,9],[12,8,12,9],[13,8,13,9],[127,1,127,4],[125,1,125,4],[65,1,65,4],[94,1,94,3],[17,1,17,3],[96,2,96,4],[123,2,123,4],[122,2,122,4],[121,2,121,4]]}
[]
[null,null,null,null,null,null,null,null,null,null,{"$f":"Year1DfE","v":0}]
[]
[]
[null,null,{"$f":"schoolname","v":""}]
[]
["2020/21 Early Years Budget Estimation"]
[]
[]
[null,"Hourly Rate","Hourly rate",null,"Summer Term",null,"Autumn Term",null,"Spring Term"]
[null,"Base rate",null,null,{"$f":"IFERROR(VLOOKUP(Year1DfE,dataslate,44,0),0)","v":0},null,{"$f":"E11","v":0},null,{"$f":"G11","v":0}]
[null,"Qualified Teacher Supplement",null,null,{"$f":"IFERROR(VLOOKUP(Year1DfE,dataslate,45,0),0)","v":0},null,{"$f":"E12","v":0},null,{"$f":"G12","v":0}]
[null,"Disadvantage supplement",null,null,{"$f":"IFERROR(VLOOKUP(Year1DfE,dataslate,46,0),0)","v":0},null,{"$f":"IFERROR(VLOOKUP(Year1DfE,dataslate,46,0),0)","v":0},null,{"$f":"IFERROR(VLOOKUP(Year1DfE,dataslate,46,0),0)","v":0}]
[null,null,null,null,{"$f":"SUM(E11:E13)","v":0},null,{"$f":"SUM(G11:G13)","v":0},null,{"$f":"SUM(I11:I13)","v":0}]
[]
{"$rows_left_out":114}
{"sheet":"High Needs Mainstream","index":5,"n_rows":85,"n_cols":55,"rows_kept":85,"cut":false,"hidden":false,"merged":[[80,11,80,12],[75,11,75,12],[76,11,76,12],[77,11,77,12],[78,11,78,12],[79,11,79,12],[70,11,70,12],[71,11,71,12],[72,11,72,12],[73,11,73,12],[74,11,74,12],[65,11,65,12],[66,11,66,12],[67,11,67,12],[68,11,68,12],[69,11,69,12],[60,11,60,12],[61,11,61,12],[62,11,62,12],[63,11,63,12],[64,11,64,12],[55,11,55,12],[56,11,56,12],[57,11,57,12],[58,11,58,12],[59,11,59,12],[50,11,50,12],[51,11,51,12],[52,11,52,12],[53,11,53,12],[54,11,54,12],[45,11,45,12],[46,11,46,12],[47,11,47,12],[48,11,48,12],[49,11,49,12],[40,11,40,12],[41,11,41,12],[42,11,42,12],[43,11,43,12],[44,11,44,12],[26,11,26,12],[83,2,83,10],[84,2,84,10],[27,11,27,12],[28,11,28,12],[29,11,29,12],[30,11,30,12],[31,11,31,12],[32,11,32,12],[33,11,33,12],[34,11,34,12],[35,11,35,12],[36,11,36,12],[37,11,37,12],[38,11,38,12],[39,11,39,12],[4,28,4,39],[3,3,3,12],[14,28,14,40],[14,42,14,54],[82,11,82,12],[82,2,82,10],[14,14,14,26],[4,3,4,12],[14,2,14,12],[15,11,15,12],[16,11,16,12],[17,11,17,12],[18,11,18,12],[19,11,19,12],[20,11,20,12],[21,11,21,12],[8,2,8,6],[9,2,9,6],[10,2,10,6],[11,2,11,6],[25,11,25,12],[22,11,22,12],[23,11,23,12],[24,11,24,12]]}
[null,null,null,null,null,null,null,null,null,null,null,null,null,null,"Notional SEN budget top up rate working"]
[null,null,null,{"$f":"Year1DfE","v":0},null,null,null,null,null,null,null,null,null,null,"Notional AEN/SEN Budget"]
[null,null,null,null,null,null,null,null,null,null,null,null,null,null,null,null,null,"IDACI",null,null,{"$f":"IFERROR(VLOOKUP($D$2,Data!$A:$K,Data!F1,0),0)","v":0}]
[null,null,null,{"$f":"schoolname","v":""},null,null,null,null,null,null,null,null,null,null,null,null,null,"Ever 6 FSM",null,null,{"$f":"IFERROR(VLOOKUP($D$2,Data!$A:$K,Data!G1,0),0)","v":0}]
[null,null,null,"2020/21",null,null,null,null,null,null,null,null,null,null,null,null,null,"Low Cost, high Incidence SEN",null,null,{"$f":"IFERROR(VLOOKUP($D$2,Data!$A:$K,Data!H1,0),0)","v":0},null,null,null,null,null,null,null,"Extra top up due to 28% rule",null,null,null,null,null,null,null,null,null,null,null,"Total"]
[null,null,null,null,null,null,null,null,null,null,null,null,null,null,null,null,null,"English as an additional language",null,null,{"$f":"IFERROR(VLOOKUP($D$2,Data!$A:$K,Data!I1,0),0)","v":0},null,null,null,null,null,null,null,{"$f":"AC13","v":0},{"$f":"AD13","v":0},0,0,0,0,0,0,0,0,0,0,{"$f":"SUM(AC6:AN6)","v":0}]
[null,null,null,null,null,null,null,null,null,null,null,null,null,null,null,null,null,"Element of Lump Sum",null,null,{"$f":"IFERROR(VLOOKUP($D$2,Data!$A:$K,Data!J1,0),0)","v":0},null,null,null,null,null,null,"count of pupils funded",{"$f":"COUNTIF(O17:O81,\">0\")","v":0},{"$f":"COUNTIF(P17:P81,\">0\")","v":0},0,0,0,0,0,0,0,0,0,0]
[null,null,null,null,null,null,null,null,null,null,null,null,null,null,null,null,null,"Area Cost Adjustment-London Fringe",null,null,{"$f":"IFERROR(SUM(U3:U7)*SUM(VLOOKUP(D2,Data!$A:$K,Data!K1,0)-1),0)","v":0},null,null,null,null,null,null,"Sixth Form Months",{"$f":"COUNTIF(AQ17:AQ81,\">0\")","v":0},{"$f":"COUNTIF(AR17:AR81,\">0\")","v":0},0,0,0,0,0,0,0,0,0,0]
[null,null,"High Needs Mainstream Funding  - Element 3 Top Up",null,null,null,null,{"$f":"AA83","v":0},null,null,null,null,null,null,"Total (with Area Cost Adjustment if applicable)",null,null,null,null,null,null,null,{"$f":"SUM(U3:U8)","v":0},null,null,null,null,"School Funded Months",{"$f":"AC7-AC8","v":0},{"$f":"AD7-AD8","v":0},0,0,0,0,0,0,0,0,0,0]
[null,null,"High Needs Mainstream Funding - Notional SEN Top Up 10%",null,null,null,null,{"$f":"AO83","v":0},null,null,null,null,null,null,"School Contribution per Pre-16 Pupil",null,null,null,null,null,null,null,6000,null,null,null,null,"School Funded",{"$f":"AC9*(500-(sentopup/12))","v":0},0,0,0,0,0,0,0,0,0,0,0]
[null,null,"High Needs Mainstream Funding - Notional SEN Top Up 28%",null,null,null,null,{"$f":"AO6","v":0},null,null,null,null,null,null,"Notional AEN/SEN Top Up per Pre-16 Pupil (10%)",null,null,null,null,null,null,null,{"$f":"IF(Year1DfE=1001,0,IF(W9>=60000,0,6000-(W9*0.1)))","v":6000},null,null,null,null,"Cumulative funded",{"$f":"AC10","v":0},{"$f":"AC11+AD10","v":0},{"$f":"AD11+AE10","v":0},{"$f":"AE11+AF10","v":0},{"$f":"AF11+AG10","v":0},0,0,0,0,0,0,0]
[null,null,"High Needs Mainstream Funding - Element 2 Post 16",null,null,null,null,{"$f":"BC83","v":0},null,null,null,null,null,null,"Maximum Contribution for all Pre-16 Pupils (28%)",null,null,null,null,null,null,null,{"$f":"W9*0.28","v":0},null,null,null,null,"Excess over threshold",{"$f":"IF(AC11-senmax<0,0,AC11-senmax)","v":0},0,0,0,0,0,0,0,0,0,0,0]
[null,null,null,null,null,null,null,{"$f":"SUM(H9:H12)","v":0},null,null,null,null,null,null,null,null,null,null,null,null,null,null,null,null,null,null,null,"Less payments to date",{"$f":"AC12","v":0},{"$f":"AD12-AC13","v":0},{"$f":"AE12-SUM($AC13:AD13)","v":0},{"$f":"AF12-SUM($AC13:AE13)","v":0},{"$f":"AG12-SUM($AC13:AF13)","v":0},{"$f":"AH12-SUM($AC13:AG13)","v":0},{"$f":"AI12-SUM($AC13:AH13)","v":0},{"$f":"AJ12-SUM($AC13:AI13)","v":0},{"$f":"AK12-SUM($AC13:AJ13)","v":0},{"$f":"AL12-SUM($AC13:AK13)","v":0},{"$f":"AM12-SUM($AC13:AL13)","v":0},{"$f":"AN12-SUM($AC13:AM13)","v":0}]
[null,null,null,null,"2019-09-01","2020-09-01"]
[null,null,"Pupil Data",null,null,null,null,null,null,null,null,null,null,null,"Element 3 top up",null,null,null,null,null,null,null,null,null,null,null,null,null,"Notional SEN budget top up",null,null,null,null,null,null,null,null,null,null,null,null,null,"Post 16 Element 2"]
{"$rows_left_out":71}
{"sheet":"Specialist Resourced Provision","index":6,"n_rows":195,"n_cols":32,"rows_kept":195,"cut":false,"hidden":false,"merged":[[40,4,40,5],[41,4,41,5],[42,4,42,5],[48,4,48,5],[49,4,49,5],[43,4,43,5],[44,4,44,5],[45,4,45,5],[46,4,46,5],[47,4,47,5],[11,1,12,7],[5,2,5,8],[7,2,7,8],[38,4,38,5],[39,4,39,5],[14,1,15,7],[36,3,37,3],[17,3,18,3],[17,5,18,5],[17,6,18,6],[37,4,37,5]]}
[]
[null,null,null,null,null,null,null,{"$f":"Year1DfE","v":0}]
[]
[]
[]
[null,null,{"$f":"schoolname","v":""}]
[]
[null,null,"High Needs funding in a Specialist Resourced Provision (SRP) - Place Plus "]
[]
[null,"2020/21 Place Funding",null,null,null,null,null,null,null,null,"2020/21 Element 3 Input (top-up funding)"]
[]
[]
[]
[null,"Excess Place Funding (Elements 1 & 2)",null,null,null,null,null,null,null,null,"Pupils should only be recorded on this sheet where the School is named on the pupils Education Health Care Plan (EHCP)"]
[null,"Place funding is guaranteed for your commissioned number of places, no place funding will be deducted. Excess Place funding is only relevant where you exceed your commissioned places and will only ever be a positive amount.",null,null,null,null,null,null,null,null,"A designation must always be selected.  Most schools only have one designation in which case this would always be 1."]
{"$rows_left_out":181}
{"sheet":"SRP Rates","index":7,"n_rows":48,"n_cols":41,"rows_kept":48,"cut":false,"hidden":false,"merged":[[5,1,5,2],[4,5,4,6],[4,7,4,8],[1,28,1,33],[1,22,1,26],[3,17,4,20],[4,9,4,10],[1,5,1,10],[1,12,1,20]]}
[null,"How your SRP rate was calculated…",null,null,null,"Step 1",null,null,null,null,null,null,"Step 2",null,null,null,null,null,null,null,null,null,"Step 3",null,null,null,null,null,"Step 4"]
[null,null,null,null,null,"First of all we need to establish the commissioned place numbers pre and post 16 in both relevant academic years and the weighted average number of places in the financial year.",null,null,null,null,null,null,"The first part of your SRP rate is based on the rates previously known as Individually assigned resources (IAR). There are four rates based on the need type of the pupil, so we need to establish the mix of needs types at your school and allocate your places using this mix.",null,null,null,null,null,null,null,null,null,"Now that we have established the mix to be used, we can work out the total amount of cash that your number of places should attract if you are exactly at capacity. Then work out the average per place and feed it into your SRP rate.",null,null,null,null,null,"Finally we can now bring everything together to find your SRP rate. The rate is only the IAR element as these pupils also attract funding through either the schools formula budget or the 16-19 allocations. From the total rate we deduct £6,000 element 2 to reach the element 3 rate."]
[null,null,null,null,null,null,null,null,null,null,null,null,null,null,null,null,null,null,null,null,null,null,15133.277419990043,19790.036293320056,11079.219608167476,13106.768514078762,"1-3"]
[null,null,null,null,null,"Place Numbers",null,null,null,null,null,null,"Actual pupils in October 2019 census",null,null,null,null,"Spread of commissioned places with October mix",null,null,null,null,14613.277419990043,16670.036293320056,8999.2196081674774,11026.768514078762,"4-20"]
[null,null,null,null,null,"2019/20 Academic",null,"2020/21 Academic",null,"2020/21 Financial",null,null,null,null,null,null,null,null,null,null,null,null,13053.277419990043,15630.036293320056,6919.2196081674774,8946.7685140787617,"21+"]
[null,"DFE",null,"School",null,"Pre 16","Post 16","Pre 16","Post 16","Pre 16","Post 16",null,"ASD","PD, HI & VI","SLCN & SPLD","SLD",null,"ASD","PD, HI & VI","SLCN & SPLD","SLD",null,"ASD","PD, HI & VI","SLCN & SPLD","SLD","Average £",null,"Total £","Element 1 pre-16","Element 1 post-16","Element 2","Element 3","Element 3 \n(Monthly)","Census Pupils","SEN Budget","Check","Des 1 Rate","Check","Des 2 Rate","Check"]
["6909A",6909,6909,"The Marsh Academy",null,12,0,15,0,13.75,0,null,11,0,0,0,null,13.75,0,0,0,null,202492.56452486309,0,0,0,14726.731965444589,null,14726.731965444589,"Included in the Schools Formula Budget","Included in 16-19 allocation",6000,8726.7319654445892,{"$f":"AG7/12","v":727.2276637870491},{"$f":"SUM(M7:P7)","v":11}]
["6914A",6914,6914,"Longfield Academy",null,36,0,36,0,36,0,null,38,0,1,0,null,35.076923076923073,0,0.92307692307692302,0,null,490628.80796272762,0,10226.971946000745,0,13912.660553020236,null,13912.660553020236,"Included in the Schools Formula Budget","Included in 16-19 allocation",6000,7912.660553020236,659.388379418353,39]
["6917A",6917,6917,"Dover Christ Church Academy",null,38,0,54,0,47.333333333333336,0,null,15,3,15,21,null,13.148148148148149,2.6296296296296298,13.148148148148149,18.407407407407408,null,193697.53644801726,52040.465808360146,124563.07262590571,209214.22042582018,12243.280886790915,null,12243.280886790915,"Included in the Schools Formula Budget","Included in 16-19 allocation",6000,6243.2808867909152,520.27340723257623,54]
["6920A",6920,6920,"Wilmington Academy",null,10,0,15,0,12.916666666666668,0,null,11,0,0,0,null,12.916666666666668,0,0,0,null,190314.83334153809,0,0,0,14734.051613538431,null,14734.051613538431,"Included in the Schools Formula Budget","Included in 16-19 allocation",6000,8734.0516135384314,727.83763446153591,11]
["6910A",6910,"6910A","Leigh Academy",null,4,0,4,0,4,0,null,0,2,0,0,null,0,4,0,0,null,0,76040.145173280223,0,0,19010.036293320056,null,19010.036293320056,"Included in the Schools Formula Budget","Included in 16-19 allocation",6000,13010.036293320056,1084.1696911100046,2]
["6910B",6910,"6910B","Leigh Academy Language Unit",null,10,0,10,0,10,0,null,0,1,9,0,null,0,1,9,0,null,0,19790.036293320056,87232.976473507297,0,10702.301276682734,null,10702.301276682734,"Included in the Schools Formula Budget","Included in 16-19 allocation",6000,4702.3012766827342,391.85843972356116,10]
["2007A",2007,"A2007","Molehill Copse Primary Academy",null,4,0,6,0,5.166666666666667,0,null,0,1,0,0,null,0,5.166666666666667,0,0,null,0,95488.520848820306,0,0,18481.649196545866,null,18481.649196545866,"Included in the Schools Formula Budget","Included in 16-19 allocation",6000,12481.649196545866,1040.1374330454889,1]
["2029A",2029,"A2029","Tymberwood Academy",null,4,0,4,0,4,0,null,0,5,0,0,null,0,4,0,0,null,0,76040.145173280223,0,0,19010.036293320056,null,19010.036293320056,"Included in the Schools Formula Budget","Included in 16-19 allocation",6000,13010.036293320056,{"$f":"AG14/12","v":1084.1696911100046},{"$f":"SUM(M14:P14)","v":5}]
["2034A",2034,"A2034","Thistle Hill Academy",null,8,0,8,0,8,0,null,0,0,3,0,null,0,0,8,0,null,0,0,78233.756865339819,0,9779.2196081674774,null,9779.2196081674774,"Included in the Schools Formula Budget","Included in 16-19 allocation",6000,3779.2196081674774,314.93496734728978,3]
{"$rows_left_out":33}