{"text_format":"1","workbook":"xlsx","n_sheets":8,"sheets":["HOME","Early Years","Place Plus","Place Plus Resourced Provision","Growth Funding","DATA","SRP data","TestArea"],"not_rendered":{"charts":0,"images":1,"macros":1,"external_links":0,"defined_names":47,"comments":0,"pivot_tables":0},"unopened":[],"bounds":{"document_bytes":16777216,"sheet_cells":100000,"rows_first":2000,"rows_last":500,"rows_between":2000,"halvings":0,"cell_chars":16384,"cell_head_chars":4096},"cells_cut":0,"cells_raw":0,"read":"whole","date_system":"1900"}

{"sheet":"HOME","index":0,"n_rows":23,"n_cols":7,"rows_kept":23,"cut":false,"hidden":false,"merged":[[14,6,14,18],[16,6,16,18],[18,6,18,18],[20,6,20,18],[22,6,22,18]]}
[]
[]
[]
[]
[]
[]
[]
[]
[]
[]
{"$rows_left_out":14}
{"sheet":"Early Years","index":1,"n_rows":46,"n_cols":11,"rows_kept":46,"cut":false,"hidden":false,"merged":[[6,0,6,10],[17,2,17,4],[17,5,17,7],[17,8,17,10],[4,2,4,7]]}
[]
[null,null,null,null,null,null,null,null,null,null,{"$f":"dfenum","v":0}]
[]
[]
[null,null,{"$f":"VLOOKUP(dfenum,academies,2,0)","v":{"$error":"#N/A"}}]
[]
["2014/15 Early Years Budget Estimation"]
[]
[null,"Hourly Rate",null,null,null,null,"Hourly rate"]
[null,"Base rate",null,null,null,null,{"$f":"VLOOKUP(dfenum,DATA!$B$3:$G$145,4,0)","v":{"$error":"#N/A"}}]
{"$rows_left_out":37}
{"sheet":"Place Plus","index":2,"n_rows":110,"n_cols":97,"rows_kept":110,"cut":false,"hidden":false,"merged":[[11,79,11,90],[11,93,11,94],[11,95,11,96],[6,1,6,6],[8,1,8,6],[11,43,11,54],[11,55,11,66],[11,67,11,78]]}
[]
[null,null,null,null,null,null,{"$f":"dfenum","v":0}]
[]
[]
[]
[]
[null,{"$f":"VLOOKUP(dfenum,academies,2,0)","v":{"$error":"#N/A"}}]
[]
[null,"Place Plus Funding for High Needs Pupils in Mainstream Provision Not a Resourced Provision"]
[null,"Pupil Numbers",null,null,null,null,null,null,null,null,"Only Pupils who have had high needs funding agreed by Kent County Council should be entered here"]
{"$rows_left_out":101}
{"sheet":"Place Plus Resourced Provision","index":3,"n_rows":163,"n_cols":33,"rows_kept":163,"cut":false,"hidden":false,"merged":[[90,6,92,6],[93,6,96,6],[97,6,100,6],[101,6,104,6],[84,6,86,6],[78,6,79,6],[80,6,81,6],[82,6,83,6],[87,6,89,6],[78,1,79,2],[80,1,81,2],[82,1,83,2],[84,1,86,2],[87,1,89,2],[90,1,92,2],[93,1,96,2],[97,1,100,2],[101,1,104,2],[144,1,147,2],[132,1,132,2],[133,1,133,2],[134,1,134,2],[135,1,135,2],[136,1,136,2],[127,1,127,2],[128,1,128,2],[129,1,129,2],[130,1,130,2],[131,1,131,2],[122,1,122,2],[143,1,143,2],[137,1,137,2],[138,1,138,2],[139,1,139,2],[140,1,140,2],[141,1,141,2],[144,0,151,0],[106,0,142,0],[5,1,5,5],[7,1,7,5],[78,0,100,0],[101,0,105,0],[107,1,107,2],[108,1,108,2],[109,1,109,2],[110,1,110,2],[111,1,111,2],[112,1,112,2],[113,1,113,2],[114,1,114,2],[115,1,115,2],[116,1,116,2],[106,6,142,6],[144,6,147,6],[148,6,151,6],[106,1,106,2],[105,1,105,3],[123,1,123,2],[124,1,124,2],[125,1,125,2],[126,1,126,2],[117,1,117,2],[118,1,118,2],[119,1,119,2],[120,1,120,2],[121,1,121,2],[148,1,151,2],[142,1,142,2]]}
[]
[null,null,null,null,{"$f":"RIGHT(dfenum,4)*1","v":{"$error":"#VALUE!"}}]
[]
[]
[]
[null,{"$f":"VLOOKUP(dfenum,academies,2,0)","v":{"$error":"#N/A"}}]
[]
[null,"Place Plus Funding for High Needs Pupils in Resourced Provision"]
[]
[null,null,null,null,null,null,null,null,"Only Pupils who have had high needs funding agreed by Kent County Council should be entered here"]
{"$rows_left_out":154}
{"sheet":"Growth Funding","index":4,"n_rows":45,"n_cols":8,"rows_kept":45,"cut":false,"hidden":false,"merged":[[44,1,44,7],[6,1,6,7],[8,1,8,7],[41,1,42,5],[9,1,9,7],[34,1,34,5],[39,1,39,5],[32,1,32,5],[37,1,37,5]]}
[]
[null,null,null,null,null,null,null,{"$f":"dfenum","v":0}]
[]
[]
[]
[]
[null,{"$f":"VLOOKUP(dfenum,academies,2,0)","v":{"$error":"#N/A"}}]
[]
[null,"Growth Funding Estimator"]
[null,{"$f":"IF(VLOOKUP(dfenum,DATA!B3:BG145,58,0)=1,\"Your academy does not qualify for Growth Funding\",\"\")","v":{"$error":"#N/A"}}]
{"$rows_left_out":36}
{"sheet":"DATA","index":5,"n_rows":145,"n_cols":60,"rows_kept":145,"cut":false,"hidden":true,"merged":[]}
[]
[null,"DFE","School","Status","Base rate","Qualified Teacher Supplement","Disadvantage supplement","Primary Pupils in budget","IDACI % 1","IDACI % 2","IDACI % 3","IDACI % 4","IDACI % 5","IDACI % 6","IDACI £ 1","IDACI £ 2","IDACI £ 3","IDACI £ 4","IDACI £ 5","IDACI £ 6","Secondary Pupils in budget","IDACI % 1","IDACI % 2","IDACI % 3","IDACI % 4","IDACI % 5","IDACI % 6","IDACI £ 1","IDACI £ 2","IDACI £ 3","IDACI £ 4","IDACI £ 5","IDACI £ 6","IDACI","Looked After Children %","Looked After Children £","Year 1 SEN","Year 2-5 SEN","Secondary SEN","Year 1 Pupils","EAL Primary","EAL Secondary","EAL Primary","EAL Secondary","English as an additional language","Element of Lump Sum","London Fringe","Primary SEN","Secondary SEN","SEN","AEN/SEN Budget","Data Calc SEN","Data Calc Topup","Check","Oct 13 Pupils inc Uplift","Basic Entitlement","MFG","Initial formula budget","Estimated Nums","Rising Roll Carried Forward"]
[8862001,"A2001","Horizon Primary Academy","Recoupment Academy",0,0,0,162,0.22500000000000001,0,0.27500000000000002,0.34375,0,0,15116.908395546219,0,20855.191355896211,28675.721051858472,0,0,0,0,0,0,0,0,0,0,0,0,0,0,0,64647.8208033009,6.9444444444444441E-3,{"$f":"((H3+U3)*AI3)*525.417015561615","v":591.09414250681687},0.45833333333333298,0.29577464788732399,0,27,7.69230769230769E-2,0,{"$f":"(H3*AO3)*884.9368830738","v":11027.67500445812},{"$f":"(U3*AP3)*3343.9902149541","v":0},{"$f":"AQ3+AR3","v":11027.67500445812},{"$f":"IF(H3>0,6235,5580)","v":6235},1.016316166,57359.710098055009,{"$f":"(U3*AM3)*1105.54126971233","v":0},{"$f":"AW3+AV3","v":57359.710098055009},{"$f":"(AH3+AJ3+AS3+AT3+AX3)*AU3","v":142143.30023688506},142143.30023688506,1735.7009928934485,{"$f":"AY3-AZ3","v":0},162,1590.8120007362968,52728.847645719536,791759.96484076767,0,2052.4548054953602]
[8862003,"A2003","Oaks Academy","Recoupment Academy",3.9,0.9,0.13,125,0.13223140495867799,7.43801652892562E-2,0.12396694214876,0.48760330578512401,1.6528925619834701E-2,5.7851239669421503E-2,6855.041274947569,4048.7912943379865,7254.080528388622,31385.805568256485,1170.3305704257266,5120.1962456125511,0,0,0,0,0,0,0,0,0,0,0,0,0,55834.245481968945,0,{"$f":"((H4+U4)*AI4)*525.417015561615","v":0},0.68421052631578905,0.5,0,19,8.6538461538461495E-2,0,{"$f":"(H4*AO4)*884.9368830738","v":9572.634552481004},{"$f":"(U4*AP4)*3343.9902149541","v":0},{"$f":"AQ4+AR4","v":9572.634552481004},{"$f":"IF(H4>0,6235,5580)","v":6235},1,70840.588583694815,{"$f":"(U4*AM4)*1105.54126971233","v":0},{"$f":"AW4+AV4","v":70840.588583694815},{"$f":"(AH4+AJ4+AS4+AT4+AX4)*AU4","v":142482.46861814475},142482.46861814475,1725.5259414556576,{"$f":"AY4-AZ4","v":0},{"$f":"H4","v":125},1590.8120007362968,30905.47,650382.02,0,0]
[8862004,"A2004","Tree Tops Academy","Recoupment Academy",3.9,0.9,0.77,214,0.10280373831775701,1.4018691588785E-2,0.10280373831775701,0.20560747663551401,4.6728971962616802E-3,0.44859813084112099,9124.0599369551946,1306.4099909730526,10298.859928837634,22657.35984344373,566.43999608605179,67972.799530326054,0,0,0,0,0,0,0,0,0,0,0,0,0,111925.92922662172,2.3255813953488372E-2,2614.8660774461769,0.441176470588235,0.316239316239316,0,36,8.3333333333333301E-2,0,15781.374414816093,0,15781.374414816093,6235,1,77805.563576831119,0,77805.563576831119,214362.73329571512,214362.73329571512,0,0,{"$f":"H5","v":214},1590.8120007362968,98023.46,1050119.18,0,0]
[8862005,"A2005","York Road Junior Academy and Language Unit","Recoupment Academy",0,0,0,301,3.64741641337386E-2,0.155015197568389,1.2158054711246201E-2,4.8632218844984802E-2,0,0,4553.2059259853777,20318.84475321924,1713.1565839072273,7537.8450542984947,0,0,0,0,0,0,0,0,0,0,0,0,0,0,0,34123.052317410344,0,0,0,0.32314410480349298,0,0,8.84146341463415E-2,0,23550.652598631717,0,23550.652598631717,6235,1.016316166,102371.76549705207,0,102371.76549705207,168993.53017091224,168993.53017091224,930.19409487263329,0,301,1590.8120007362968,17795.334709720686,1155541.8027492478,0,0]
[8862006,"A2006","St James the Great Academy","Recoupment Academy",3.9,0.9,0.25,161,0.31055900621117999,0,1.2422360248447201E-2,0.50310559006211197,0,0,20736.499856716342,0,936.25999353069369,41710.139711794152,0,0,0,0,0,0,0,0,0,0,0,0,0,0,0,63382.899562041188,6.0975609756097563E-3,515.8057286915855,0.34482758620689702,0.22222222222222199,0,30,2.8776978417266199E-2,0,4099.9953431620679,0,4099.9953431620679,6235,1,42602.271102982806,0,42602.271102982806,116835.97173687765,116835.97173687763,2494.9208478936712,0,{"$f":"H7","v":161},1590.8120007362968,63192.9,767356.82,0,0]
[8862007,"A2007","MOLEHILL COPSE PRIMARY ACADEMY","Recoupment Academy",0,0,0,278,0.150877192982456,9.4736842105263203E-2,0.28070175438596501,0.140350877192982,4.2105263157894701E-2,0.15438596491228099,17395.376792083298,11468.904552331895,36530.565361618676,20091.693896259447,6630.3292173440977,30389.008912827154,0,0,0,0,0,0,0,0,0,0,0,0,0,122505.87873246457,7.0921985815602835E-3,1035.9285838732551,0.5,0.36486486486486502,0,45,3.7037037037037E-2,0,9111.5723516487469,0,9111.5723516487469,6235,1,115742.73030474462,0,115742.73030474462,254631.10997273118,254631.10997273121,0,0,{"$f":"H8","v":278},1590.8120007362968,0,1169997.52,0,0]
[8862009,"A2009","Northdown Primary School","Recoupment Academy",3.9,0.9,0.65,313,3.1948881789137401E-3,1.91693290734824E-2,8.6261980830670895E-2,0.36102236421725198,0.34504792332268402,0.12779552715654999,414.72999713432728,2612.8199819461101,12639.509912664364,58188.219597934971,61175.519577293671,28321.999804302664,0,0,0,0,0,0,0,0,0,0,0,0,0,163352.79887127611,1.6611295681063124E-2,2731.8193666243437,0.76190476190476197,0.20945945945945901,0,46,0.19465648854961801,0,53916.975055370407,0,53916.975055370407,6235,1,107054.78174454739,0,107054.78174454739,333291.37503781822,333291.37503781822,0,0,313,1590.8120007362968,115755.89339696523,1479831.6157392499,0,0]
[8862010,"A2010","Newlands Primary School","Recoupment Academy",0,0,0,384,5.7894736842105297E-2,9.4736842105263203E-2,0.244736842105263,0.28421052631578902,0.115789473684211,0,9220.1026731336751,15841.940101062761,43994.364327589632,56198.925085364644,25185.710983868354,0,0,0,0,0,0,0,0,0,0,0,0,0,0,150441.04317101906,7.4074074074074077E-3,1494.5195109308161,0.51219512195121997,0.35164835164835201,0,84,9.375E-2,0,31857.727790656802,0,31857.727790656802,6235,1,161244.93992252651,0,161244.93992252651,351273.23039513314,351273.23039513314,0,0,384,1590.8120007362968,87123.335394480964,1676854.0694990151,0,0]
{"$rows_left_out":136}
{"sheet":"SRP data","index":6,"n_rows":113,"n_cols":68,"rows_kept":113,"cut":false,"hidden":true,"merged":[]}
["DFE","School","Phase","Pre 16","Post 16","Pre 16","Post 16","Pre 16","Post 16","Primary","KS3","KS4","Primary","KS3","KS4","Pre 16","KS3","KS4","Primary","KS3","KS4","Post 16","ASD","PD, HI & VI","SLCN & SPLD","SLD",null,"ASD","PD, HI & VI","SLCN & SPLD","SLD",null,null,"Primary AWPU","KS3 AWPU","KS4 AWPU","FSM%","FSM PUPILS","FSM CASH","IDACI % 1","IDACI Pupils 1","IDACI Cash 1","IDACI % 2","IDACI Pupils 2","IDACI Cash 2","IDACI % 3","IDACI Pupils 3","IDACI Cash 3","IDACI % 4","IDACI Pupils 4","IDACI Cash 4","IDACI % 5","IDACI Pupils 5","IDACI Cash 5","IDACI % 6","IDACI Pupils 6","IDACI Cash 6","LAC%","LAC Pupils","LAC CASH","EAL%","EAL Pupils","EAL Cash","PA Funding","Pupils in APT","PA CASH","London Fringe %","London Fringe"]
["2005A","YORK ROAD JUNIOR SCHOOL AND LU","Primary",28,0,28,0,28.000000000000004,0,28.000000000000004,0,0,22,0,0,6.0000000000000036,0,0,34.000000000000007,0,0,0,4,0,18,0,0,57704.913153807858,0,161755.72398751401,0,9975.4835064237213,279313.53817986423,92721.61375720131,0,0,0.13677811550152,4.6504559270516808,1669.9809500430931,3.64741641337386E-2,1.2401215805471126,514.31561954652113,0.155015197568389,5.2705167173252265,2295.1518990347327,1.2158054711246201E-2,0.41337386018237088,193.51270383005237,4.8632218844984802E-2,1.6534954407294835,851.45093636594288,0,0,0,0,0,0,0,0,0,8.84146341463415E-2,3.0060975609756118,2660.2066058255091,111894.7204270104,329,11563.588129235121,1.016316166,1835.0762629174751]
["2007A","MOLEHILL COPSE PRIMARY SCHOOL","Primary",12,0,10,0,10.833333333333334,0,12,0,0,10,0,0,2,0,0,12.833333333333334,0,0,0,0,10,0,0,0,0,169288.81051269284,0,0,16928.881051269283,183396.21138875058,34997.864016198531,0,0,0.393728222996516,5.0528455284552889,1814.4792485713165,0.150877192982456,1.9362573099415188,803.02398860336575,9.4736842105263203E-2,1.2157894736842112,529.43983844697618,0.28070175438596501,3.6023391812865513,1686.3630292833568,0.140350877192982,1.8011695906432692,927.49426259710867,4.2105263157894701E-2,0.54035087719298203,306.07634876228735,0.15438596491228099,1.9812865497076062,1402.8499318271538,7.0921985815602835E-3,9.101654846335698E-2,47.821643260336131,3.7037037037037E-2,0.4753086419753082,420.61814812766977,120738.81938264727,287,5398.8902975980482,1,0]
["2155A","SLADE PRIMARY SCHOOL","Primary",6,0,5,0,5.416666666666667,0,6,0,0,4,0,0,2,0,0,7.416666666666667,0,0,0,0,4,0,0,0,0,73115.524205077134,0,0,18278.881051269283,99010.605694375292,20226.038295075774,0,0,7.0739549839228297E-2,0.52465166130760987,188.4026627788387,0,0,0,1.9354838709677399E-2,0.14354838709677406,62.511015697097854,3.2258064516129002E-3,2.3924731182795679E-2,11.199884331213944,6.4516129032258099E-3,4.7849462365591428E-2,24.639601980284613,0,0,0,3.2258064516129002E-3,2.3924731182795679E-2,16.939905796928276,9.6774193548387101E-3,7.17741935483871E-2,37.711382568535278,9.3984962406015005E-2,0.69705513784461126,616.849801014788,66677.946922534044,311,1590.1225284312782,1,0]
["2463A","MINTERNE COMMUNITY JUNIOR SCHOOL","Primary",28,0,28,0,28.000000000000004,0,28.000000000000004,0,0,25,0,0,3.0000000000000036,0,0,31.000000000000007,0,0,0,0,0,25,0,0,0,0,212327.39442710282,0,8493.0957770841123,237806.68175835517,84540.294896271793,0,0,7.9283887468030695E-2,2.4578005115089523,882.59734047803329,4.6035805626598501E-2,1.4271099744245539,591.86531560346475,0.138107416879795,4.2813299232736455,1864.3907288055348,6.6496163682864498E-2,2.0613810741687999,964.99431558278832,1.5345268542199499E-2,0.47570332480818461,244.95866838412795,1.7902813299232701E-2,0.55498721227621384,314.36695434954731,0,0,0,5.1020408163265302E-3,0.15816326530612249,83.101670828622815,7.6726342710997401E-3,0.237851662404092,210.48370876179879,60809.255203336652,391,4821.194146556104,1,0]
["2490A","BISHOPS DOWN PRIMARY SCHOOL","Primary",6,0,6,0,6,0,6,0,0,5,0,0,1,0,0,7,0,0,0,0,5,0,0,0,0,89144.405256346421,0,0,17828.881051269283,106973.28630761569,19089.744008835562,0,0,6.0509554140127403E-2,0.42356687898089185,152.1030690459088,0.168789808917197,1.1815286624203789,490.01537877972896,1.27388535031847E-2,8.9171974522292904E-2,38.83171947690613,3.1847133757961798E-3,2.2292993630573257E-2,10.436019036170165,0,0,0,0,0,0,0,0,0,0,0,0,8.7786259541984699E-2,0.61450381679389288,543.7970922705407,58123.652893224695,314,1295.7502237343085,1,0]
["2513A","THE OAKS INFANT SCHOOL","Primary",12,0,12,0,12,0,12,0,0,10,0,0,2,0,0,14,0,0,0,0,0,10,0,0,0,0,92530.957770841109,0,9253.0957770841105,111037.14932500932,38179.488017671123,0,0,8.5714285714285701E-2,1.1999999999999997,430.92057456013839,2.8571428571428598E-2,0.40000000000000036,165.89199885373094,0.189285714285714,2.6499999999999959,1153.9954920261989,3.9285714285714299E-2,0.55000000000000016,257.47149822094104,1.7857142857142901E-2,0.25000000000000061,128.73499911047602,0,0,0,0,0,0,3.5460992907801418E-3,4.9645390070921988E-2,26.084532687456072,5.2631578947368397E-2,0.73684210526315752,652.05875594911515,58123.190020015572,280,2906.1595010007786,1,0]
["2568A","MOREHALL PRIMARY SCHOOL","Primary",5,0,5,0,5,0,5,0,0,5,0,0,0,0,0,5,0,0,0,0,5,0,0,0,0,89144.405256346421,0,0,17828.881051269283,89144.405256346421,13635.531434882543,0,0,0.24456521739130399,1.22282608695652,439.11743331535786,0.114754098360656,0.57377049180327999,237.9598344213357,1.63934426229508E-2,8.1967213114753995E-2,35.694262048444152,0.13661202185792401,0.68306010928962002,319.76092675228756,7.6502732240437202E-2,0.38251366120218599,196.97158333843288,2.1857923497267801E-2,0.109289617486339,61.906010501207952,2.1857923497267801E-2,0.109289617486339,77.38251312650992,0,0,0,4.3749999999999997E-2,0.21875,193.57994317239366,50423.364862362498,184,1370.2001321294156,1,0]
["2661A","CAGE GREEN PRIMARY SCHOOL","Primary",28,0,30,0,29.166666666666668,0,28.000000000000004,0,0,29,0,0,-0.99999999999999645,0,0,28.166666666666671,0,0,0,28,0,1,0,0,382934.392076655,0,10653.095777084111,0,13571.982339784108,395849.48491036985,76813.493749838337,0,0,0.158415841584158,4.4620462046204512,1602.3229285074417,2.48138957816377E-3,6.9892473118279536E-2,28.986505176055097,4.7146401985111698E-2,1.3279569892473131,578.28542611173032,7.4441687344913203E-3,0.20967741935483888,98.156289644347083,0.13647642679900701,3.8440860215053649,1979.473642236341,0,0,0,0,0,0,2.5773195876288659E-3,7.2594501718213064E-2,38.142386438966049,4.3227665706051903E-2,1.2175792507204621,1077.480787027898,119794.28906281455,404,8351.9945757490368,1,0]
["3086A","WEST MALLING C.E. PRIMARY","Primary",17,0,19,0,18.166666666666668,0,17,0,0,17,0,0,0,0,0,18.166666666666668,0,0,0,1,0,16,0,0,14551.228288451965,0,144449.5324333458,0,9352.9859248116336,169912.57763407801,49542.430880073247,0,0,0.25,4.541666666666667,1630.9146745505243,4.80769230769231E-2,0.87339743589743635,362.2241160868723,0.21153846153846201,3.8429487179487269,1673.488866641773,4.3269230769230803E-2,0.78605769230769296,367.97718495737661,6.25E-2,1.1354166666666667,584.67145429341053,0,0,0,0,0,0,5.235602094240838E-3,9.5113438045375226E-2,49.974218757605634,1.1428571428571401E-2,0.20761904761904712,183.72975286675032,64026.847265393983,208,5592.0884230191868,1,0]
{"$rows_left_out":104}
{"sheet":"TestArea","index":7,"n_rows":140,"n_cols":58,"rows_kept":140,"cut":false,"hidden":true,"merged":[]}
["DFE",{"$f":"MAX(E1,H1,K1,N1,Q1,T1,W1,Z1,AC1,AF1,AI1,AL1,AO1,AR1)","v":5.0167301669716835E-3},"Early Years Rate",null,{"$f":"MAX(MIN(E2:E137)*-1,MAX(E2:E137))","v":0},"Notional Budget",null,{"$f":"MAX(MIN(H2:H137)*-1,MAX(H2:H137))","v":4.9621817888692021E-3},"SEN Topup",null,{"$f":"MAX(MIN(K2:K137)*-1,MAX(K2:K137))","v":4.9174653097452392E-3},"SEN Max",null,{"$f":"MAX(MIN(N2:N137)*-1,MAX(N2:N137))","v":4.9924363556783646E-3},"E3 SRP 1",null,{"$f":"MAX(MIN(Q2:Q137)*-1,MAX(Q2:Q137))","v":4.9452164521426312E-3},"E3 SRP 2",null,{"$f":"MAX(MIN(T2:T137)*-1,MAX(T2:T137))","v":3.0624148935203266E-3},"E3 SRP Post-16 1",null,{"$f":"MAX(MIN(W2:W137)*-1,MAX(W2:W137))","v":3.5720131536436384E-3},"E3 SRP Post-16 2",null,{"$f":"MAX(MIN(Z2:Z137)*-1,MAX(Z2:Z137))","v":2.6832884141185787E-3},"Place Funding",null,{"$f":"MAX(MIN(AC2:AC137)*-1,MAX(AC2:AC137))","v":3.3333333412883803E-3},"Budget Pupil Number",null,{"$f":"MAX(MIN(AF2:AF137)*-1,MAX(AF2:AF137))","v":0},"Rising Roll Unit Value",null,{"$f":"MAX(MIN(AI2:AI137)*-1,MAX(AI2:AI137))","v":4.8888284695749462E-3},"MFG",null,{"$f":"MAX(MIN(AL2:AL137)*-1,MAX(AL2:AL137))","v":4.983489474398084E-3},"Rising Roll Threshold",null,{"$f":"MAX(MIN(AO2:AO137)*-1,MAX(AO2:AO137))","v":0},"Initial Budget for Rising Roll",null,{"$f":"MAX(MIN(AR2:AR137)*-1,MAX(AR2:AR137))","v":5.0167301669716835E-3},"less 50 pupils","less 5 pupils","same pupils","plus 5 pupils","plus 50 pupils","Threshold Pupils","Funded Pupils","Provisional Cash","Less MFG","5k 10k threshold","half percent",{"$f":"MAX(MIN(BD2:BD137)*-1,MAX(BD2:BD137))","v":0.49952048107115843},"Rising Roll Brought Forward",{"$f":"MAX(MIN(BF2:BF137)*-1,MAX(BF2:BF137))","v":1.9221981441660319E-2}]
["A2001","Horizon Primary Academy",0,0,{"$f":"C2-D2","v":0},142143.29999999999,142143.30023688506,{"$f":"F2-G2","v":-2.3688506917096674E-4},1735.7,1735.7009928934485,{"$f":"I2-J2","v":-9.9289344848330074E-4},28428.66,{"$f":"G2/5","v":28428.660047377012},{"$f":"L2-M2","v":-4.7377012379001826E-5},0,0,{"$f":"O2-P2","v":0},null,null,{"$f":"R2-S2","v":0},null,0,{"$f":"U2-V2","v":0},null,null,{"$f":"X2-Y2","v":0},0,0,{"$f":"AA2-AB2","v":0},162,162,{"$f":"AD2-AE2","v":0},1590.81,1590.8120007362968,{"$f":"AG2-AH2","v":-2.0007362968499365E-3},52728.85,52728.847645719536,{"$f":"AJ2-AK2","v":2.3542804628959857E-3},2000,2000,{"$f":"AM2-AN2","v":0},791759.96,791759.96484076767,{"$f":"AP2-AQ2","v":-4.8407677095383406E-3},2052.4499999999998,2052.4499999999998,2052.4499999999998,2052.4499999999998,20910.45,{"$f":"IF(AD2>250,AD2*0.02,5)","v":5},{"$f":"ROUND(50-AX2,0)","v":45},{"$f":"AY2*AH2","v":71586.540033133351},{"$f":"AZ2-AK2","v":18857.692387413816},{"$f":"IF(BA2>AN2,BA2,0)","v":18857.692387413816},{"$f":"IF(BB2>(AQ2*0.005),BB2,0)","v":18857.692387413816},{"$f":"BC2-AW2+BE2","v":-0.30280709082489921},{"$f":"VLOOKUP(A2,DATA!$B$3:$BH$145,59,0)","v":2052.4548054953602},{"$f":"SUM(AS2:AV2)-(4*BE2)","v":-1.9221981441660319E-2}]
["A2003","Oaks Academy",4.93,4.93,{"$f":"C3-D3","v":0},142482.47,142482.46861814475,{"$f":"F3-G3","v":1.3818552542943507E-3},1725.53,1725.5259414556576,{"$f":"I3-J3","v":4.0585443423424294E-3},28496.49,{"$f":"G3/5","v":28496.493723628948},{"$f":"L3-M3","v":-3.7236289463180583E-3},0,0,{"$f":"O3-P3","v":0},null,null,{"$f":"R3-S3","v":0},null,0,{"$f":"U3-V3","v":0},null,null,{"$f":"X3-Y3","v":0},0,0,{"$f":"AA3-AB3","v":0},125,125,{"$f":"AD3-AE3","v":0},1590.81,1590.8120007362968,{"$f":"AG3-AH3","v":-2.0007362968499365E-3},30905.47,30905.47,{"$f":"AJ3-AK3","v":0},2000,2000,{"$f":"AM3-AN3","v":0},650382.02,650382.02,{"$f":"AP3-AQ3","v":0},0,0,0,0,40681,{"$f":"IF(AD3>250,AD3*0.02,5)","v":5},{"$f":"ROUND(50-AX3,0)","v":45},{"$f":"AY3*AH3","v":71586.540033133351},{"$f":"AZ3-AK3","v":40681.07003313335},{"$f":"IF(BA3>AN3,BA3,0)","v":40681.07003313335},{"$f":"IF(BB3>(AQ3*0.005),BB3,0)","v":40681.07003313335},{"$f":"BC3-AW3+BE3","v":7.0033133350079879E-2},{"$f":"VLOOKUP(A3,DATA!$B$3:$BH$145,59,0)","v":0},{"$f":"SUM(AS3:AV3)-(4*BE3)","v":0}]
["A2004","Tree Tops Academy",5.57,5.57,0,214362.73,214362.73329571512,-3.295715112471953E-3,0,0,0,42872.55,42872.546659143023,3.3408569797757082E-3,0,0,0,null,null,0,null,0,0,null,null,0,0,0,0,214,214,0,1590.81,1590.8120007362968,-2.0007362968499365E-3,98023.46,98023.46,0,2000,2000,0,1050119.18,1050119.18,0,0,0,0,0,0,5,45,71586.540033133351,-26436.919966866655,0,0,0,{"$f":"VLOOKUP(A4,DATA!$B$3:$BH$145,59,0)","v":0},0]
["A2005","York Road Junior Academy and Language Unit",0,0,0,168993.53,168993.53017091224,-1.7091224435716867E-4,930.19,930.19409487263329,-4.0948726332317165E-3,33798.71,33798.706034182447,3.9658175519434735E-3,4057.8,4057.8012515665705,-1.2515665703176637E-3,null,null,0,null,0,0,null,null,0,280000,280000.00000000006,0,301,301,0,1590.81,1590.8120007362968,-2.0007362968499365E-3,17795.330000000002,17795.334709720686,-4.7097206843318418E-3,2000,2000,0,1155541.8,1155541.8027492478,-2.7492477092891932E-3,0,0,0,0,52200,6.0200000000000005,44,69995.728032397063,52200.393322676377,52200.393322676377,52200.393322676377,0.39332267637655605,{"$f":"VLOOKUP(A5,DATA!$B$3:$BH$145,59,0)","v":0},0]
["A2006","St James the Great Academy",5.05,5.05,0,116835.97,116835.97173687763,-1.7368776316288859E-3,2494.92,2494.9208478936712,-8.478936711071583E-4,23367.19,23367.194347375527,-4.3473755285958759E-3,0,0,0,null,null,0,null,0,0,null,null,0,0,0,0,161,161,0,1590.81,1590.8120007362968,-2.0007362968499365E-3,63192.9,63192.9,0,2000,2000,0,767356.82,767356.82,0,0,0,0,0,8394,5,45,71586.540033133351,8393.6400331333498,8393.6400331333498,8393.6400331333498,-0.35996686665021116,{"$f":"VLOOKUP(A6,DATA!$B$3:$BH$145,59,0)","v":0},0]
["A2007","MOLEHILL COPSE PRIMARY ACADEMY",0,0,0,254631.11,254631.10997273121,2.726877573877573E-5,0,0,0,50926.22,50926.221994546242,-1.9945462408941239E-3,11390.57,11390.566043879389,3.9561206103826407E-3,null,null,0,null,0,0,null,null,0,108333.33,108333.33333333334,-3.3333333412883803E-3,278,278,0,1590.81,1590.8120007362968,-2.0007362968499365E-3,0,0,0,2000,2000,0,1169997.52,1169997.52,0,0,0,0,0,69996,5.5600000000000005,44,69995.728032397063,69995.728032397063,69995.728032397063,69995.728032397063,-0.27196760293736588,{"$f":"VLOOKUP(A7,DATA!$B$3:$BH$145,59,0)","v":0},0]
["A2009","Northdown Primary School",5.45,5.45,0,333291.38,333291.37503781822,4.9621817888692021E-3,0,0,0,66658.28,66658.275007563643,4.9924363556783646E-3,0,0,0,null,null,0,null,0,0,null,null,0,0,0,0,313,313,0,1590.81,1590.8120007362968,-2.0007362968499365E-3,115755.89,115755.89339696523,-3.3969652286032215E-3,2000,2000,0,1479831.62,1479831.6157392499,4.2607502546161413E-3,0,0,0,0,0,6.26,44,69995.728032397063,-45760.165364568165,0,0,0,{"$f":"VLOOKUP(A8,DATA!$B$3:$BH$145,59,0)","v":0},0]
["A2010","Newlands Primary School",0,0,0,351273.23,351273.23039513314,-3.9513316005468369E-4,0,0,0,70254.649999999994,70254.646079026628,3.9209733658935875E-3,0,0,0,null,null,0,null,0,0,null,null,0,0,0,0,384,384,0,1590.81,1590.8120007362968,-2.0007362968499365E-3,87123.34,87123.335394480964,4.6055190323386341E-3,2000,2000,0,1676854.07,1676854.0694990151,5.0098495557904243E-4,0,0,0,0,0,7.68,42,66814.104030924471,-20309.231363556493,0,0,0,{"$f":"VLOOKUP(A9,DATA!$B$3:$BH$145,59,0)","v":0},0]
["A2011","Salmestone Primary School",5.07,5.07,0,390264.5,390264.50119373621,-1.1937362141907215E-3,0,0,0,78052.899999999994,78052.900238747243,-2.3874724865891039E-4,0,0,0,null,null,0,null,0,0,null,null,0,0,0,0,413,413,0,1590.81,1590.8120007362966,-2.0007362966225628E-3,0,0,0,2000,2000,0,1685277.32,1685277.3216730179,-1.6730178613215685E-3,0,0,0,0,66814,8.26,42,66814.104030924456,66814.104030924456,66814.104030924456,66814.104030924456,0.10403092445631046,{"$f":"VLOOKUP(A10,DATA!$B$3:$BH$145,59,0)","v":0},0]
{"$rows_left_out":130}