{"text_format":"1","workbook":"xlsx","n_sheets":3,"sheets":["Special Rates 2023-24","DATA","Firing Range"],"not_rendered":{"charts":0,"images":1,"macros":1,"external_links":0,"defined_names":57,"comments":0,"pivot_tables":0},"unopened":[],"bounds":{"document_bytes":16777216,"sheet_cells":100000,"rows_first":2000,"rows_last":500,"rows_between":2000,"halvings":0,"cell_chars":16384,"cell_head_chars":4096},"cells_cut":0,"cells_raw":0,"read":"whole","date_system":"1900"}

{"sheet":"Special Rates 2023-24","index":0,"n_rows":146,"n_cols":19,"rows_kept":146,"cut":false,"hidden":false,"merged":[]}
[]
[]
[]
[null,null,null,null,"2023/24 Calculation of Special School Funding Rates"]
[]
[]
[]
[null,"DfE",null,null,{"$f":"IFERROR(VLOOKUP(DFENUM,DATA!B5:C28,2,0),\"\")","v":""}]
[]
[]
[null,"Section 1 - Commissioned Place numbers"]
[]
[null,"Academic Year","Pre-16","Post-16","Weekday Residential","Weekend Residential",null,"High Needs Place numbers as agreed annually with the Local Authority's SEN team\n\n"]
[]
[null,"2022/23",{"$f":"IFERROR(VLOOKUP(DFENUM,DATA!B5:K28,3,0),0)","v":0},{"$f":"IFERROR(VLOOKUP(DFENUM,DATA!B5:K28,5,0),0)","v":0},{"$f":"IFERROR(VLOOKUP(DFENUM,DATA!B5:K28,7,0),0)","v":0},{"$f":"IFERROR(VLOOKUP(DFENUM,DATA!B5:K28,9,0),0)","v":0},null,"Place numbers 2022-23 agreed November 2021"]
{"$rows_left_out":132}
{"sheet":"DATA","index":1,"n_rows":28,"n_cols":93,"rows_kept":28,"cut":false,"hidden":true,"merged":[[1,85,1,92],[2,85,2,92],[1,63,1,73],[2,63,2,67],[2,69,2,73],[1,74,1,84],[2,74,2,78],[2,80,2,84],[2,58,2,59],[2,60,2,61],[1,47,1,55],[2,47,2,49],[2,50,2,52],[2,53,2,55],[2,56,2,57],[1,3,1,10],[2,3,2,4],[2,5,2,6],[2,7,2,8],[2,9,2,10],[2,29,2,36],[2,14,2,16],[2,17,2,19],[2,20,2,22],[1,11,1,25],[2,23,2,25],[2,11,2,13]]}
[null,1,2,3,4,5,6,7,8,9,10,11,12,13,14,15,16,17,18,19,20,21,22,23,24,25,26,27,28,29,30,31,32,33,34,35,36,37,38,39,40,41,42,43,44,45,46,47,48,49,50,51,52,53,54,55,56,57,58,59,60,61,62,63,64,65,66,67,68,69,70,71,72,73,74,75,76,77,78,79,80,81,82,83,84,85,86,87,88,89,90,91,92]
[null,null,null,"Places",null,null,null,null,null,null,null,"Rates",null,null,null,null,null,null,null,null,null,null,null,null,null,null,null,null,null,null,null,null,null,null,null,null,null,null,null,null,null,null,null,null,null,null,null,"Residential Rates",null,null,null,null,null,null,null,null,null,null,null,null,null,null,null,"2022/23 Financial Year",null,null,null,null,null,null,null,null,null,null,"2023/24 Financial Year",null,null,null,null,null,null,null,null,null,null,"2021/22 Financial Year"]
[null,null,null,"Pre-16",null,"Post-16",null,"Weekday",null,"Weekend",null,"MLD & SLCN",null,null,"ASD",null,null,"SEMH",null,null,"SLD",null,null,"PD & PMLD",null,null,null,null,null,"London Fringe",null,null,null,null,null,null,null,null,null,null,null,null,null,null,null,null,null,"ASD Weekday",null,null,"PD Weekday",null,null,"PD Weekend",null,null,"Residential Winter Rates",null,"Residential Pupil Fringe",null,"Residential School Fringe",null,null,"Pupil Led",null,null,null,null,"School","MFG",null,null,null,null,"Pupil Led",null,null,null,null,"School","MFG",null,null,null,null,"Total rate"]
[null,"DFE","School","22/23","23/24","22/23","23/24","22/23","23/24","22/23","23/24","Summer","Winter","Old Financial Year","Summer","Winter","Old Financial Year","Summer","Winter","Old Financial Year","Summer","Winter","Old Financial Year","Summer","Winter","Old Financial Year",null,"ASD Rate","SEMH Rate","MLD & SLCN","SEMH","SLD","PD & PMLD","ASD","Residential weekdayASD","Residential weekdayPD & PMLD","Residential WeekendPD & PMLD","Gross Day Floor Area","Residential floor area weekday","Residential floor area weekend","Grounds site area","Rentals","Hydrotherapy Pool","No of FSM","London Fringe","Split  site- Band  1","Split site - Band 2","Summer","Last Financial Year","Winter","Summer","Last Financial Year","Winter","Summer","Last Financial Year","Winter","Weekday","Weekend","Weekday","Weekend","Weekday","Weekend","Nursery FTE","MLD&SLCN","SEMH","SLD","PD&PMLD","ASD","All","MLD&SLCN","SEMH","SLD","PD&PMLD","ASD","MLD&SLCN","SEMH","SLD","PD&PMLD","ASD","All","MLD&SLCN","SEMH","SLD","PD&PMLD","ASD","MLD & SLCN","ASD","SEMH","SLD","PD & PMLD","ASD Weekday","PD Weekday","PD Weekend"]
[null,7002,"Broomhill Bank School",218,269,100,107,23,23,0,0,13082.956804321117,12678.086340235641,14529.83,20470.332078203093,20065.461614117619,20545.71,19642.929474102657,19238.059010017183,19460.599999999999,17456.454500785763,17051.584036700286,18083.41,24744.834228633401,24339.963764547927,24516.989999999998,null,17319.588949978079,16521.638781698548,45.427074564687857,61.238726065289754,71.184438127963801,114.0819613963608,90.691161886194664,0,0,0,11140.8930014898,632.10699851023674,0,10.685,0,0,0.29199999999999998,1,0,1,60199.580721003607,59779.4,59794.71025691813,0,0,0,0,0,0,27770.888472523024,0,988.64468127036548,0,11.522510317914893,0,{"$error":"#VALUE!"},10214.060726009444,16715.520259985205,14548.548036678072,21771.917439896748,17535.54266246334,2745.0753608560649,1570.6939131344916,0,789.78660246586151,0,265.09197668059642,10305.987272543527,16865.959942325069,14679.484969008176,21967.864696855817,17693.362546425509,2540.7950943943956,2118.9425330620779,53.844963280535012,1405.6322365974302,221.23850874978962,927.92365918009455,14529.83,20545.71,18684.346139590896,18083.41,24009.61,59779.4]
[null,7005,"Aspire School",136,172,0,0,0,0,0,0,13518.112101137627,13425.013716913696,13384.19,20860.2232876981,20767.124903474167,20660.809999999998,20062.273119418569,19969.174735194636,19869.98,17865.852434038999,17772.754049815067,17693.150000000001,25111.334638618242,25018.236254394309,24874.010000000002,null,17319.588949978079,16521.638781698548,0,0,0,0,0,0,0,0,3227,0,0,1.7432000000000001,0,0,0.35606060606060608,0,0,0,0,0,0,0,0,0,0,0,0,0,0,0,0,0,0,{"$error":"#VALUE!"},10169.038848343745,16654.827766362519,14477.998543984351,21658.853057938017,17445.660440574149,3215.1525893272828,0,0,0,0,0,10260.560197978841,16804.721216259779,14608.300530880209,21853.782735459452,17602.67138453931,3203.2445123614962,0,0,0,0,0,12851.453308560915,19848.20483955169,19087.788806655888,16994.683785138419,23899.35158701695]
[null,7006,"Snowfields Academy",120,226,0,12,0,0,0,0,14649.275605845922,13412.141001905371,13399.45,21991.386792406389,20754.252188465838,20676.07,21193.436624126858,19956.302020186307,19885.239999999998,18997.015938747292,17759.881334806742,17708.41,26242.498143326535,25005.36353938598,24889.260000000002,null,17319.588949978079,16521.638781698548,0,0,0,0,0,0,0,0,7642,0,0,7.3,0,0,0.32163742690058478,0,0,1,0,0,0,0,0,0,0,0,0,0,0,0,0,0,0,{"$error":"#VALUE!"},10169.038848343745,16654.827766362519,14477.998543984351,21658.853057938017,17445.660440574149,3230.4090509178759,0,0,0,0,0,10260.560197978841,16804.721216259779,14608.300530880209,21853.782735459452,17602.67138453931,3667.0535555684278,0,0,0,0,0,12890.696882526703,19887.448413517479,19127.032380621677,17033.927359104207,23938.595160982739]
[null,7021,"Valence School",80,80,30,30,46,46,18,18,17255.006502709006,17222.270299952514,17051.54,23932.78980710579,23900.053604349298,23669.760000000002,23851.029737911918,23818.293535155426,23588.73,21687.230988097923,21654.494785341427,21444.23,29073.417068997504,29040.680866241011,28764.54,null,16521.638781698548,16521.638781698548,173.7225820582799,225.58479898025485,258.2067345458251,398.91061086616583,307.34486817412522,0,0,0,8799,0,1924,18.321999999999999,0,1,0.26315789473684209,1,0,0,0,0,0,81182.389953611841,80408.710000000006,81149.653750855345,109339.46894826677,108314.64,109306.73274551028,42651.041324346566,26849.248533291109,1278.5702066470587,1810.7893099308924,39.38603526850909,39.38603526850909,{"$error":"#VALUE!"},10341.211873178512,16878.400411536211,14733.902146111039,22054.205496853938,16959.431203601493,6710.3316857098871,0,0,0,0,0,10434.28278003712,17030.306015240032,14866.507265426037,22252.693346325617,17112.066084433904,6801.6276043972666,0,0,0,0,0,16499.298843025721,22862.971276124743,22785.057052985048,20723.039490076226,27761.792711944399,null,77419.653583918116,104252.27441438139]
[null,7032,"Bower Grove School",225,225,0,0,0,0,0,0,12976.221006125608,12997.373815150899,12847.95,19520.38202440655,19541.534833431841,19333.73,19520.38202440655,19541.534833431841,19333.73,17323.961339026981,17345.114148052271,17156.900000000001,24569.443543606223,24590.596352631514,24337.760000000002,null,16521.638781698548,16521.638781698548,0,0,0,0,0,0,0,0,4185.3,0,0,2.1496,0,0,0.59401709401709402,0,1,0,0,0,0,0,0,0,0,0,0,0,0,0,0,0,0,{"$error":"#VALUE!"},10169.038848343745,16654.827766362519,14477.998543984351,21658.853057938017,16654.827766362519,2678.9062518171695,0,0,0,0,0,10260.560197978841,16804.721216259779,14608.300530880209,21853.782735459452,16804.721216259779,2727.9999467448561,0,0,0,0,0,12371.154861324856,18607.490359419833,18607.490359419833,16514.385337902364,23419.053139780888]
[null,7033,"St Anthony's School",110,106,0,0,0,0,0,0,15391.896421882589,15586.724506842907,15483.34,21936.057440163528,22130.885525123849,21969.129999999997,21936.057440163528,22130.885525123849,21969.129999999997,19739.636754783958,19934.464839744276,19792.3,26985.118959363201,27179.947044323522,26973.15,null,16521.638781698548,16521.638781698548,0,0,0,0,0,0,0,0,3614,0,0,1.54,0,0,0.7289719626168224,0,0,0,0,0,0,0,0,0,0,0,0,0,0,0,0,0,0,{"$error":"#VALUE!"},10169.038848343745,16654.827766362519,14477.998543984351,21658.853057938017,16654.827766362519,5314.299239287222,0,0,0,0,0,10260.560197978841,16804.721216259779,14608.300530880209,21853.782735459452,16804.721216259779,5244.985940130603,127.01058878853655,6.2751335454195214,46.797646761999204,0,6.2751335454195214,15177.239540677649,21413.575038772622,21413.575038772622,19320.470017255157,26225.137819133681]
[null,7039,"The Ifield School",220,227,41,39,0,0,0,0,12904.604159150313,12857.552392233018,12837.48,20246.715345710785,20199.663578793487,20114.099999999999,19448.765177431254,19401.713410513956,19323.260000000002,17252.344492051685,17205.292725134386,17146.439999999999,24497.826696630924,24450.774929713629,24327.29,null,17319.588949978079,16521.638781698548,0,0,0,0,0,0,0,0,4274.1399960000008,0,0,6.22,75000,1,0.39436619718309857,0,1,0,0,0,0,0,0,0,0,0,0,0,0,0,0,0,0,{"$error":"#VALUE!"},10169.038848343745,16654.827766362519,14477.998543984351,21658.853057938017,17445.660440574149,2668.4364691150918,0,0,0,0,0,10260.560197978841,16804.721216259779,14608.300530880209,21853.782735459452,17602.67138453931,2616.5970971363854,0,0,0,0,0,12333.063304256921,19329.814835247689,18569.398802351894,16476.293780834425,23380.961582712949]
[null,7040,"Foreland Fields School",209,213,33,30,0,0,0,0,13124.539076540057,13111.348353514699,12900.34,20466.650263100528,20453.459540075168,20176.97,19668.700094820997,19655.509371795637,19386.129999999997,17472.279409441428,17459.088686416068,17209.3,24717.761614020666,24704.57089099531,24390.16,null,17319.588949978079,16521.638781698548,0,0,0,0,0,0,0,0,4490.5,0,0,4.4852999999999996,63000,1,0.46500000000000002,0,2,0,0,0,0,0,0,0,0,0,0,0,0,0,0,0,0,{"$error":"#VALUE!"},10169.038848343745,16654.827766362519,14477.998543984351,21658.853057938017,17445.660440574149,2731.3052024518674,0,0,0,0,0,10260.560197978841,16804.721216259779,14608.300530880209,21853.782735459452,17602.67138453931,2856.284290129759,0,0,0,0,0,12371.275865631,19368.027396621772,18607.611363725977,16514.506342208508,23419.174144087032]
[null,7041,"Goldwyn School",150,160,45,35,0,0,0,0,14116.969340625137,14133.600693463375,14106.029999999999,20661.130358906077,20677.761711744315,20522.379999999997,20661.130358906077,20677.761711744315,20522.379999999997,18464.709673526508,18481.341026364746,18345.55,25710.191878105747,25726.823230943992,25526.400000000001,null,16521.638781698548,16521.638781698548,0,0,0,0,0,0,0,0,5856.3800899999997,0,0,7.3492000000000006,47900,0,0.4759036144578313,0,2,1,0,0,0,0,0,0,0,0,0,0,0,0,0,0,0,{"$error":"#VALUE!"},10169.038848343745,16654.827766362519,14477.998543984351,21658.853057938017,16654.827766362519,3867.5510927895775,69.440058866677646,0,0,0,0,10260.560197978841,16804.721216259779,14608.300530880209,21853.782735459452,16804.721216259779,3866.1107651352704,402.53993688589253,0,0,0,0,14106.03,20001.576819235335,20001.576819235335,17908.471797717866,24813.13959959639]
[null,7043,"The Beacon Folkestone",329,278,73,130,0,0,0,0,12371.704289803118,12345.359006735052,12252.69,19713.81547636359,19687.470193295521,19529.309999999998,18915.86530808406,18889.520025015991,18738.47,16719.44462270449,16693.099339636421,16561.64,23964.926827283733,23938.581544215664,23742.5,null,17319.588949978079,16521.638781698548,0,0,0,0,0,0,0,0,8748,0,0,2.4561000000000002,0,1,0.52037617554858939,0,0,1,0,0,0,0,0,0,0,0,0,0,0,0,0,0,0,{"$error":"#VALUE!"},10169.038848343745,16654.827766362519,14477.998543984351,21658.853057938017,17445.660440574149,2083.6462966621712,0,0,0,0,0,10260.560197978841,16804.721216259779,14608.300530880209,21853.782735459452,17602.67138453931,2095.7760100345736,0,0,0,0,0,11771.35,18650.843736187941,17890.427703292145,15797.322681774676,22701.9904836532]
[null,7044,"Rowhill School",132,132,0,0,0,0,0,0,14884.939863230713,14888.716218048692,14744.01,21562.723167627497,21566.499522445476,21362.23,21489.405714274297,21493.182069092276,21289.57,19317.164348619626,19320.940703437605,19136.7,26703.350429519211,26707.12678433719,26457.01,null,16521.638781698548,16521.638781698548,173.72258205828047,234.02741482092557,258.20673454582561,398.91061086616628,307.34486817412591,0,0,0,4165,0,0,1.8948,0,0,0.58666666666666667,1,0,0,0,0,0,0,0,0,0,0,0,0,0,0,0,0,0,{"$error":"#VALUE!"},10341.211873178512,16886.767721586431,14733.902146111039,22054.205496853945,16959.431203601496,4402.8022744849804,0,0,0,0,0,10434.28278003712,17038.748631080707,14866.507265426037,22252.693346325617,17112.066084433904,4452.8599568374148,85.040263125465572,0,0,0,0,14536.1,20863.346554949196,20793.477822242407,18723.414768900682,25762.167990768859]
{"$rows_left_out":14}
{"sheet":"Firing Range","index":2,"n_rows":54,"n_cols":50,"rows_kept":54,"cut":false,"hidden":true,"merged":[]}
[{"$f":"COUNTIF(B1:AT1,\">0\")-22","v":4},null,7032,{"$f":"COUNTIF(D2:D108,\">0\")","v":16},7033,{"$f":"COUNTIF(F2:F108,\">0\")","v":0},7044,{"$f":"COUNTIF(H2:H108,\">0\")","v":0},7045,{"$f":"COUNTIF(J2:J108,\">0\")","v":0},7062,{"$f":"COUNTIF(L2:L108,\">0\")","v":0},7041,{"$f":"COUNTIF(N2:N108,\">0\")","v":0},7067,{"$f":"COUNTIF(P2:P108,\">0\")","v":0},7021,{"$f":"COUNTIF(R2:R108,\">0\")","v":0},7002,{"$f":"COUNTIF(T2:T108,\">0\")","v":1},7052,{"$f":"COUNTIF(V2:V108,\">0\")","v":0},7058,{"$f":"COUNTIF(X2:X108,\">0\")","v":0},7073,{"$f":"COUNTIF(Z2:Z108,\">0\")","v":16},7039,{"$f":"COUNTIF(AB2:AB108,\">0\")","v":0},7040,{"$f":"COUNTIF(AD2:AD108,\">0\")","v":0},7043,{"$f":"COUNTIF(AF2:AF108,\">0\")","v":0},7051,{"$f":"COUNTIF(AH2:AH108,\">0\")","v":0},7056,{"$f":"COUNTIF(AJ2:AJ108,\">0\")","v":0},7063,{"$f":"COUNTIF(AL2:AL108,\">0\")","v":0},7066,{"$f":"COUNTIF(AN2:AN108,\">0\")","v":0},7069,{"$f":"COUNTIF(AP2:AP108,\">0\")","v":3},7070,{"$f":"COUNTIF(AR2:AR108,\">0\")","v":0},7072,{"$f":"COUNTIF(AT2:AT108,\">0\")","v":0},7005,{"$f":"COUNTIF(AV2:AV108,\">0\")","v":0},7006,{"$f":"COUNTIF(AX2:AX108,\">0\")","v":17}]
["DFENUM",{"$f":"'Special Rates 2023-24'!DFENUM","v":0},7032,{"$f":"IF(C2=C1,0,1)","v":0},7033,{"$f":"IF(E2=E1,0,1)","v":0},7044,{"$f":"IF(G2=G1,0,1)","v":0},7045,{"$f":"IF(I2=I1,0,1)","v":0},7062,{"$f":"IF(K2=K1,0,1)","v":0},7041,{"$f":"IF(M2=M1,0,1)","v":0},7067,{"$f":"IF(O2=O1,0,1)","v":0},7021,{"$f":"IF(Q2=Q1,0,1)","v":0},7002,{"$f":"IF(S2=S1,0,1)","v":0},7052,{"$f":"IF(U2=U1,0,1)","v":0},7058,{"$f":"IF(W2=W1,0,1)","v":0},7073,{"$f":"IF(Y2=Y1,0,1)","v":0},7039,{"$f":"IF(AA2=AA1,0,1)","v":0},7040,{"$f":"IF(AC2=AC1,0,1)","v":0},7043,{"$f":"IF(AE2=AE1,0,1)","v":0},7051,{"$f":"IF(AG2=AG1,0,1)","v":0},7056,{"$f":"IF(AI2=AI1,0,1)","v":0},7063,{"$f":"IF(AK2=AK1,0,1)","v":0},7066,{"$f":"IF(AM2=AM1,0,1)","v":0},7069,{"$f":"IF(AO2=AO1,0,1)","v":0},7070,{"$f":"IF(AQ2=AQ1,0,1)","v":0},7072,{"$f":"IF(AS2=AS1,0,1)","v":0},7005,{"$f":"IF(AU2=AU1,0,1)","v":0},7006,{"$f":"IF(AW2=AW1,0,1)","v":0}]
["NAME",{"$f":"[0]!NAME","v":""},"Bower Grove School",0,"St Anthony's School",0,"Rowhill School",0,"Elms School",0,"The Orchard School",0,"Goldwyn School",0,"Portal House School",0,"Valence School",0,"Broomhill Bank School",0,"Grange Park School",0,"Stone Bay School",0,"Laleham Gap School",0,"The Ifield School",0,"Foreland Fields School",0,"The Beacon Folkestone",0,"Nexus School",0,"Five Acre Wood School",0,"St Nicholas' School",0,"Milestone Academy",0,"The Wyvern School",0,"Oakley School",0,"Meadowfield School",0,"Aspire School",0,"Snowfields Academy",0]
["preold",{"$f":"[0]!preold","v":0},225,0,110,0,132,0,158,0,93,0,150,0,80,0,80,0,218,0,91,0,90,0,187,0,220,0,209,0,329,0,246,0,542,0,296,0,326,0,297,0,170,0,310,0,136,0,120,0]
["postold",{"$f":"[0]!postold","v":0},0,0,0,0,0,0,0,0,0,0,45,0,0,0,30,0,100,0,53,0,10,0,9,0,41,0,33,0,73,0,30,0,59,0,44,0,37,0,33,0,42,0,41,0,0,0,0,0]
["weekdayold",{"$f":"[0]!weekdayold","v":0},0,0,0,0,0,0,0,0,0,0,0,0,0,0,46,0,23,0,0,0,10,0,0,0,0,0,0,0,0,0,0,0,0,0,0,0,0,0,0,0,0,0,0,0,0,0,0,0]
["weekendold",{"$f":"[0]!weekendold","v":0},0,0,0,0,0,0,0,0,0,0,0,0,0,0,18,0,0,0,0,0,0,0,0,0,0,0,0,0,0,0,0,0,0,0,0,0,0,0,0,0,0,0,0,0,0,0,0,0]
["prenew",{"$f":"[0]!prenew","v":0},236,1,106,0,132,0,152,0,100,0,160,0,80,0,80,0,269,0,95,0,92,0,205,1,227,0,213,0,278,0,256,0,648,0,311,0,326,0,303,0,152,0,346,0,172,0,236,1]
["postnew",{"$f":"[0]!postnew","v":0},0,0,0,0,0,0,0,0,0,0,35,0,0,0,30,0,107,0,60,0,11,0,15,0,39,0,30,0,130,0,39,0,77,0,44,0,37,0,47,0,60,0,45,0,0,0,0,1]
["weekdaynew",{"$f":"[0]!weekdaynew","v":0},0,0,0,0,0,0,0,0,0,0,0,0,0,0,46,0,23,0,0,0,10,0,0,0,0,0,0,0,0,0,0,0,0,0,0,0,0,0,0,0,0,0,0,0,0,0,0,0]
["weekendnew",{"$f":"[0]!weekendnew","v":0},0,0,0,0,0,0,0,0,0,0,0,0,0,0,18,0,0,0,0,0,0,0,0,0,0,0,0,0,0,0,0,0,0,0,0,0,0,0,0,0,0,0,0,0,0,0,0,0]
["mldold",{"$f":"[0]!mldold","v":0},12976.221006125608,0,15391.896421882589,0,14884.939863230713,0,13800.962144589717,0,15845.774056536913,0,14116.969340625137,0,17142.27633515327,0,17255.006502709006,0,13082.956804321117,0,13693.736258187,0,15436.172875735972,0,13347.473198787298,0,12904.604159150313,0,13124.539076540057,0,12371.704289803118,0,12952.89098687646,0,11758.119018481306,0,12872.140316698195,0,12756.187738650193,0,12380.570734283385,0,13279.769475767549,0,12563.066707720895,0,13518.112101137627,0,14649.275605845922,0]
["besdold",{"$f":"[0]!besdold","v":0},19520.38202440655,0,21936.057440163528,0,21489.405714274297,0,20345.123162870659,0,22389.935074817855,0,20661.130358906077,0,23686.437353434208,0,23851.029737911918,0,19642.929474102657,0,20237.897276467938,0,21980.333894016912,0,19891.63421706824,0,19448.765177431254,0,19668.700094820997,0,18915.86530808406,0,19497.052005157399,0,18302.280036762248,0,19416.301334979133,0,19352.210973853103,0,18924.731752564327,0,19823.930494048491,0,19107.227726001831,0,20062.273119418569,0,21193.436624126858,0]
["sldold",{"$f":"[0]!sldold","v":0},17323.961339026981,0,19739.636754783958,0,19317.164348619626,0,18148.702477491086,0,20193.514389438285,0,18464.709673526508,0,21490.016668054639,0,21687.230988097923,0,17456.454500785763,0,18041.476591088373,0,19783.913208637343,0,17695.213531688671,0,17252.344492051685,0,17472.279409441428,0,16719.44462270449,0,17300.631319777829,0,16105.859351382676,0,17219.880649599563,0,17188.412224039108,0,16728.311067184757,0,17627.509808668921,0,16910.807040622265,0,17865.852434038999,0,18997.015938747292,0]
["pdold",{"$f":"[0]!pdold","v":0},24569.443543606223,0,26985.118959363201,0,26703.350429519211,0,25394.184682070332,0,27438.996594017528,0,25710.191878105747,0,28735.498872633878,0,29073.417068997504,0,24744.834228633401,0,25286.958795667611,0,27029.395413216589,0,24940.695736267913,0,24497.826696630924,0,24717.761614020666,0,23964.926827283733,0,24546.113524357072,0,23351.341555961921,0,24465.362854178806,0,24574.598304938689,0,23973.793271764,0,24872.992013248164,0,24156.289245201504,0,25111.334638618242,0,26242.498143326535,0]
{"$rows_left_out":39}