{"text_format":"1","workbook":"xlsx","n_sheets":3,"sheets":["Introduction","Benchmarking","2024-25 Data"],"not_rendered":{"charts":0,"images":2,"macros":1,"external_links":0,"defined_names":4,"comments":0,"pivot_tables":0},"unopened":[],"bounds":{"document_bytes":16777216,"sheet_cells":100000,"rows_first":2000,"rows_last":500,"rows_between":2000,"halvings":0,"cell_chars":16384,"cell_head_chars":4096},"cells_cut":0,"cells_raw":0,"read":"whole","date_system":"1900"}

{"sheet":"Introduction","index":0,"n_rows":21,"n_cols":4,"rows_kept":21,"cut":false,"hidden":false,"merged":[[6,3,9,3],[13,3,15,3]]}
[]
[]
[null,{"$f":"Benchmarking!C1&\" Data\"","v":"2024-25 Data"},null,{"$f":"\"Kent LA Schools' Benchmarking Data \"&Benchmarking!C1","v":"Kent LA Schools' Benchmarking Data 2024-25"}]
[]
[null,null,null,"THIS BENCHMARKING SHEET IS FOR SPECIAL SCHOOLS ONLY"]
[]
{"$rows_left_out":16}
{"sheet":"Benchmarking","index":1,"n_rows":75,"n_cols":22,"rows_kept":75,"cut":false,"hidden":false,"merged":[[3,4,3,5],[2,8,2,11],[2,13,2,16],[2,18,2,21],[3,18,3,21],[3,13,3,16],[3,8,3,11],[4,1,6,5],[7,3,7,6],[6,8,6,11],[7,18,7,21],[5,9,5,11],[4,9,4,11],[7,13,7,16],[5,19,5,21],[7,8,7,11],[5,14,5,16],[4,14,4,16],[4,19,4,21],[6,13,6,16],[6,18,6,21]]}
[null,"Subjective Analysis of ","2024-25"," Income and Expenditure Compared to Group and Phase Averages"]
[]
[null,null,null,null,null,null,null,null,"Select a school to Benchmark against",null,null,null,null,"Select a school to Benchmark against",null,null,null,null,"Select a school to Benchmark against"]
[null,null,"Enter last 4 digits of your DfE No.",null,"Number of Places",null,{"$f":"IF(ISERROR(ROUND(VLOOKUP(D4,'2024-25 Data'!A3:G23,7,0),0)),\"\",ROUND(VLOOKUP(D4,'2024-25 Data'!A3:G23,7,0),0))","v":""}]
[null,{"$f":"B1&C1&D1","v":"Subjective Analysis of 2024-25 Income and Expenditure Compared to Group and Phase Averages"}]
[null,null,null,null,null,null,null,null,{"$f":"IF(ISERROR(SUMIF(Schools,I4,dfenums)),\"\",SUMIF(Schools,I4,dfenums))","v":0},{"$f":"IF(ISERROR(ROUND(VLOOKUP(I6,'2024-25 Data'!$A$3:$G$23,7,0),0)),\"\",ROUND(VLOOKUP(I6,'2024-25 Data'!$A$3:$G$23,7,0),0))","v":""},null,null,null,{"$f":"IF(ISERROR(SUMIF(Schools,N4,dfenums)),\"\",SUMIF(Schools,N4,dfenums))","v":0},{"$f":"IF(ISERROR(ROUND(VLOOKUP(N6,'2024-25 Data'!$A$3:$G$23,7,0),0)),\"\",ROUND(VLOOKUP(N6,'2024-25 Data'!$A$3:$G$23,7,0),0))","v":""},null,null,null,{"$f":"IF(ISERROR(SUMIF(Schools,S4,dfenums)),\"\",SUMIF(Schools,S4,dfenums))","v":0},{"$f":"IF(ISERROR(ROUND(VLOOKUP(S6,'2024-25 Data'!$A$3:$G$23,7,0),0)),\"\",ROUND(VLOOKUP(S6,'2024-25 Data'!$A$3:$G$23,7,0),0))","v":""}]
{"$rows_left_out":70}
{"sheet":"2024-25 Data","index":2,"n_rows":73,"n_cols":68,"rows_kept":73,"cut":false,"hidden":true,"merged":[[0,6,0,7],[28,5,48,6],[51,5,71,6]]}
[null,null,"KCC Finance & Procurement","KCC Finance & Procurement","KCC Finance & Procurement","KCC Finance & Procurement","Self generating",null,"Self generating from below"]
["DfE","School","Nursery Places","Nursery Attendance","School Places","School Attendance","Total Places","Total Attendance","E01","E02","E03","E04","E05","E06","E07","E08","E09","E10","E11","E12","E13","E14","E15","E16","E17","E18","E19","E20A","E20B","E20C","E20D","E20E","E20F","E20G","E21","E22","E23","E24","E25","E26","E27","E28","E28B","E29","E30","E31","E32","I01","I02","I03","I04","I05","I06","I07","I08","I08b","I09","I10","I11","I12","I13","I15","I16","I17","I18","I18A","I18B","I18C"]
[7002,"Broomhill Bank School",0,0,393,392,{"$f":"C3+E3","v":393},{"$f":"D3+F3","v":392},{"$f":"IF(Benchmarking!$C$9=\"Yes\",I29-I52,I29)","v":4198904.0999999996},{"$f":"IF(Benchmarking!$C$9=\"Yes\",J29-J52,J29)","v":0},{"$f":"IF(Benchmarking!$C$9=\"Yes\",K29-K52,K29)","v":2671039.06},{"$f":"IF(Benchmarking!$C$9=\"Yes\",L29-L52,L29)","v":301530.14},{"$f":"IF(Benchmarking!$C$9=\"Yes\",M29-M52,M29)","v":729905.02},{"$f":"IF(Benchmarking!$C$9=\"Yes\",N29-N52,N29)","v":88413.45},{"$f":"IF(Benchmarking!$C$9=\"Yes\",O29-O52,O29)","v":342508.76},{"$f":"IF(Benchmarking!$C$9=\"Yes\",P29-P52,P29)","v":40811.980000000003},{"$f":"IF(Benchmarking!$C$9=\"Yes\",Q29-Q52,Q29)","v":15133.62},{"$f":"IF(Benchmarking!$C$9=\"Yes\",R29-R52,R29)","v":776.7},{"$f":"IF(Benchmarking!$C$9=\"Yes\",S29-S52,S29)","v":27068.04},{"$f":"IF(Benchmarking!$C$9=\"Yes\",T29-T52,T29)","v":101624.2},{"$f":"IF(Benchmarking!$C$9=\"Yes\",U29-U52,U29)","v":33753.85},{"$f":"IF(Benchmarking!$C$9=\"Yes\",V29-V52,V29)","v":155147.41},{"$f":"IF(Benchmarking!$C$9=\"Yes\",W29-W52,W29)","v":14651.22},{"$f":"IF(Benchmarking!$C$9=\"Yes\",X29-X52,X29)","v":185545.86},{"$f":"IF(Benchmarking!$C$9=\"Yes\",Y29-Y52,Y29)","v":2194.83},{"$f":"IF(Benchmarking!$C$9=\"Yes\",Z29-Z52,Z29)","v":41474.83},{"$f":"IF(Benchmarking!$C$9=\"Yes\",AA29-AA52,AA29)","v":375648.03},{"$f":"IF(Benchmarking!$C$9=\"Yes\",AB29-AB52,AB29)","v":14154.64},{"$f":"IF(Benchmarking!$C$9=\"Yes\",AC29-AC52,AC29)","v":0},{"$f":"IF(Benchmarking!$C$9=\"Yes\",AD29-AD52,AD29)","v":17154.400000000001},{"$f":"IF(Benchmarking!$C$9=\"Yes\",AE29-AE52,AE29)","v":65098.01},{"$f":"IF(Benchmarking!$C$9=\"Yes\",AF29-AF52,AF29)","v":47547.96},{"$f":"IF(Benchmarking!$C$9=\"Yes\",AG29-AG52,AG29)","v":7329.09},{"$f":"IF(Benchmarking!$C$9=\"Yes\",AH29-AH52,AH29)","v":50049.56},{"$f":"IF(Benchmarking!$C$9=\"Yes\",AI29-AI52,AI29)","v":23426.28},{"$f":"IF(Benchmarking!$C$9=\"Yes\",AJ29-AJ52,AJ29)","v":36734.699999999997},{"$f":"IF(Benchmarking!$C$9=\"Yes\",AK29-AK52,AK29)","v":16220.1},{"$f":"IF(Benchmarking!$C$9=\"Yes\",AL29-AL52,AL29)","v":6990.08},{"$f":"IF(Benchmarking!$C$9=\"Yes\",AM29-AM52,AM29)","v":223470.15},{"$f":"IF(Benchmarking!$C$9=\"Yes\",AN29-AN52,AN29)","v":45087.3},{"$f":"IF(Benchmarking!$C$9=\"Yes\",AO29-AO52,AO29)","v":335812.54},{"$f":"IF(Benchmarking!$C$9=\"Yes\",AP29-AP52,AP29)","v":63295},{"$f":"IF(Benchmarking!$C$9=\"Yes\",AQ29-AQ52,AQ29)","v":0},{"$f":"IF(Benchmarking!$C$9=\"Yes\",AR29-AR52,AR29)","v":50662.17},{"$f":"IF(Benchmarking!$C$9=\"Yes\",AS29-AS52,AS29)","v":195251.11},{"$f":"IF(Benchmarking!$C$9=\"Yes\",AT29-AT52,AT29)","v":0},{"$f":"IF(Benchmarking!$C$9=\"Yes\",AU29-AU52,AU29)","v":0},{"$f":"IF(Benchmarking!$C$9=\"Yes\",AV29-AV52,AV29)","v":-2967543.98},{"$f":"IF(Benchmarking!$C$9=\"Yes\",AW29-AW52,AW29)","v":-1179197.53},{"$f":"IF(Benchmarking!$C$9=\"Yes\",AX29-AX52,AX29)","v":-5771052.8899999997},{"$f":"IF(Benchmarking!$C$9=\"Yes\",AY29-AY52,AY29)","v":0},{"$f":"IF(Benchmarking!$C$9=\"Yes\",AZ29-AZ52,AZ29)","v":-126803.2},{"$f":"IF(Benchmarking!$C$9=\"Yes\",BA29-BA52,BA29)","v":-800},{"$f":"IF(Benchmarking!$C$9=\"Yes\",BB29-BB52,BB29)","v":-327416.86},{"$f":"IF(Benchmarking!$C$9=\"Yes\",BC29-BC52,BC29)","v":0},{"$f":"IF(Benchmarking!$C$9=\"Yes\",BD29-BD52,BD29)","v":-32464.9},{"$f":"IF(Benchmarking!$C$9=\"Yes\",BE29-BE52,BE29)","v":0},{"$f":"IF(Benchmarking!$C$9=\"Yes\",BF29-BF52,BF29)","v":-30306.560000000001},{"$f":"IF(Benchmarking!$C$9=\"Yes\",BG29-BG52,BG29)","v":0},{"$f":"IF(Benchmarking!$C$9=\"Yes\",BH29-BH52,BH29)","v":-19737.849999999999},{"$f":"IF(Benchmarking!$C$9=\"Yes\",BI29-BI52,BI29)","v":-8550},{"$f":"IF(Benchmarking!$C$9=\"Yes\",BJ29-BJ52,BJ29)","v":-1906.34},{"$f":"IF(Benchmarking!$C$9=\"Yes\",BK29-BK52,BK29)","v":0},{"$f":"IF(Benchmarking!$C$9=\"Yes\",BL29-BL52,BL29)","v":0},{"$f":"IF(Benchmarking!$C$9=\"Yes\",BM29-BM52,BM29)","v":-583},{"$f":"IF(Benchmarking!$C$9=\"Yes\",BN29-BN52,BN29)","v":0},{"$f":"IF(Benchmarking!$C$9=\"Yes\",BO29-BO52,BO29)","v":0},{"$f":"IF(Benchmarking!$C$9=\"Yes\",BP29-BP52,BP29)","v":-64297.81}]
[7021,"Valence School",0,0,115,127,{"$f":"C4+E4","v":115},{"$f":"D4+F4","v":127},{"$f":"IF(Benchmarking!$C$9=\"Yes\",I30-I53,I30)","v":1696948.04},{"$f":"IF(Benchmarking!$C$9=\"Yes\",J30-J53,J30)","v":0},{"$f":"IF(Benchmarking!$C$9=\"Yes\",K30-K53,K30)","v":2717595.16},{"$f":"IF(Benchmarking!$C$9=\"Yes\",L30-L53,L30)","v":312667.53999999998},{"$f":"IF(Benchmarking!$C$9=\"Yes\",M30-M53,M30)","v":434678.69},{"$f":"IF(Benchmarking!$C$9=\"Yes\",N30-N53,N30)","v":99625.55},{"$f":"IF(Benchmarking!$C$9=\"Yes\",O30-O53,O30)","v":562941.9},{"$f":"IF(Benchmarking!$C$9=\"Yes\",P30-P53,P30)","v":35849.25},{"$f":"IF(Benchmarking!$C$9=\"Yes\",Q30-Q53,Q30)","v":25793.83},{"$f":"IF(Benchmarking!$C$9=\"Yes\",R30-R53,R30)","v":226.96},{"$f":"IF(Benchmarking!$C$9=\"Yes\",S30-S53,S30)","v":9109.68},{"$f":"IF(Benchmarking!$C$9=\"Yes\",T30-T53,T30)","v":136691.49},{"$f":"IF(Benchmarking!$C$9=\"Yes\",U30-U53,U30)","v":13093.99},{"$f":"IF(Benchmarking!$C$9=\"Yes\",V30-V53,V30)","v":30538.12},{"$f":"IF(Benchmarking!$C$9=\"Yes\",W30-W53,W30)","v":21222.48},{"$f":"IF(Benchmarking!$C$9=\"Yes\",X30-X53,X30)","v":81887.81},{"$f":"IF(Benchmarking!$C$9=\"Yes\",Y30-Y53,Y30)","v":4232.4799999999996},{"$f":"IF(Benchmarking!$C$9=\"Yes\",Z30-Z53,Z30)","v":53921.01},{"$f":"IF(Benchmarking!$C$9=\"Yes\",AA30-AA53,AA30)","v":47465.99},{"$f":"IF(Benchmarking!$C$9=\"Yes\",AB30-AB53,AB30)","v":19199.38},{"$f":"IF(Benchmarking!$C$9=\"Yes\",AC30-AC53,AC30)","v":6608.12},{"$f":"IF(Benchmarking!$C$9=\"Yes\",AD30-AD53,AD30)","v":6031.53},{"$f":"IF(Benchmarking!$C$9=\"Yes\",AE30-AE53,AE30)","v":31577.1},{"$f":"IF(Benchmarking!$C$9=\"Yes\",AF30-AF53,AF30)","v":575.37},{"$f":"IF(Benchmarking!$C$9=\"Yes\",AG30-AG53,AG30)","v":4437.66},{"$f":"IF(Benchmarking!$C$9=\"Yes\",AH30-AH53,AH30)","v":3638.8},{"$f":"IF(Benchmarking!$C$9=\"Yes\",AI30-AI53,AI30)","v":7972.5},{"$f":"IF(Benchmarking!$C$9=\"Yes\",AJ30-AJ53,AJ30)","v":184044.29},{"$f":"IF(Benchmarking!$C$9=\"Yes\",AK30-AK53,AK30)","v":7004.45},{"$f":"IF(Benchmarking!$C$9=\"Yes\",AL30-AL53,AL30)","v":145.53999999999996},{"$f":"IF(Benchmarking!$C$9=\"Yes\",AM30-AM53,AM30)","v":83434.61},{"$f":"IF(Benchmarking!$C$9=\"Yes\",AN30-AN53,AN30)","v":14425.44},{"$f":"IF(Benchmarking!$C$9=\"Yes\",AO30-AO53,AO30)","v":590892.59},{"$f":"IF(Benchmarking!$C$9=\"Yes\",AP30-AP53,AP30)","v":32815.67},{"$f":"IF(Benchmarking!$C$9=\"Yes\",AQ30-AQ53,AQ30)","v":0},{"$f":"IF(Benchmarking!$C$9=\"Yes\",AR30-AR53,AR30)","v":0},{"$f":"IF(Benchmarking!$C$9=\"Yes\",AS30-AS53,AS30)","v":0},{"$f":"IF(Benchmarking!$C$9=\"Yes\",AT30-AT53,AT30)","v":0},{"$f":"IF(Benchmarking!$C$9=\"Yes\",AU30-AU53,AU30)","v":565.96},{"$f":"IF(Benchmarking!$C$9=\"Yes\",AV30-AV53,AV30)","v":-1032482.59},{"$f":"IF(Benchmarking!$C$9=\"Yes\",AW30-AW53,AW30)","v":-305447.34000000003},{"$f":"IF(Benchmarking!$C$9=\"Yes\",AX30-AX53,AX30)","v":-5283831.12},{"$f":"IF(Benchmarking!$C$9=\"Yes\",AY30-AY53,AY30)","v":0},{"$f":"IF(Benchmarking!$C$9=\"Yes\",AZ30-AZ53,AZ30)","v":-44430},{"$f":"IF(Benchmarking!$C$9=\"Yes\",BA30-BA53,BA30)","v":-6082.53},{"$f":"IF(Benchmarking!$C$9=\"Yes\",BB30-BB53,BB30)","v":-1272591.9099999999},{"$f":"IF(Benchmarking!$C$9=\"Yes\",BC30-BC53,BC30)","v":-8497.5},{"$f":"IF(Benchmarking!$C$9=\"Yes\",BD30-BD53,BD30)","v":-247657.07},{"$f":"IF(Benchmarking!$C$9=\"Yes\",BE30-BE53,BE30)","v":-19320.66},{"$f":"IF(Benchmarking!$C$9=\"Yes\",BF30-BF53,BF30)","v":0},{"$f":"IF(Benchmarking!$C$9=\"Yes\",BG30-BG53,BG30)","v":-46904.92},{"$f":"IF(Benchmarking!$C$9=\"Yes\",BH30-BH53,BH30)","v":-868},{"$f":"IF(Benchmarking!$C$9=\"Yes\",BI30-BI53,BI30)","v":-8060.81},{"$f":"IF(Benchmarking!$C$9=\"Yes\",BJ30-BJ53,BJ30)","v":0},{"$f":"IF(Benchmarking!$C$9=\"Yes\",BK30-BK53,BK30)","v":0},{"$f":"IF(Benchmarking!$C$9=\"Yes\",BL30-BL53,BL30)","v":0},{"$f":"IF(Benchmarking!$C$9=\"Yes\",BM30-BM53,BM30)","v":-21103},{"$f":"IF(Benchmarking!$C$9=\"Yes\",BN30-BN53,BN30)","v":0},{"$f":"IF(Benchmarking!$C$9=\"Yes\",BO30-BO53,BO30)","v":0},{"$f":"IF(Benchmarking!$C$9=\"Yes\",BP30-BP53,BP30)","v":-12317.3}]
[7032,"Bower Grove School",0,0,225,238,225,238,{"$f":"IF(Benchmarking!$C$9=\"Yes\",I31-I54,I31)","v":2623802.7000000002},{"$f":"IF(Benchmarking!$C$9=\"Yes\",J31-J54,J31)","v":18353.05},{"$f":"IF(Benchmarking!$C$9=\"Yes\",K31-K54,K31)","v":2193037.5699999998},{"$f":"IF(Benchmarking!$C$9=\"Yes\",L31-L54,L31)","v":98455.44},{"$f":"IF(Benchmarking!$C$9=\"Yes\",M31-M54,M31)","v":309161.09000000003},{"$f":"IF(Benchmarking!$C$9=\"Yes\",N31-N54,N31)","v":58323.39},{"$f":"IF(Benchmarking!$C$9=\"Yes\",O31-O54,O31)","v":0},{"$f":"IF(Benchmarking!$C$9=\"Yes\",P31-P54,P31)","v":11769.66},{"$f":"IF(Benchmarking!$C$9=\"Yes\",Q31-Q54,Q31)","v":27090.5},{"$f":"IF(Benchmarking!$C$9=\"Yes\",R31-R54,R31)","v":452.25},{"$f":"IF(Benchmarking!$C$9=\"Yes\",S31-S54,S31)","v":24841.68},{"$f":"IF(Benchmarking!$C$9=\"Yes\",T31-T54,T31)","v":47247.58},{"$f":"IF(Benchmarking!$C$9=\"Yes\",U31-U54,U31)","v":9742.51},{"$f":"IF(Benchmarking!$C$9=\"Yes\",V31-V54,V31)","v":95574.87},{"$f":"IF(Benchmarking!$C$9=\"Yes\",W31-W54,W31)","v":14750.27},{"$f":"IF(Benchmarking!$C$9=\"Yes\",X31-X54,X31)","v":64595.07},{"$f":"IF(Benchmarking!$C$9=\"Yes\",Y31-Y54,Y31)","v":0},{"$f":"IF(Benchmarking!$C$9=\"Yes\",Z31-Z54,Z31)","v":5781.58},{"$f":"IF(Benchmarking!$C$9=\"Yes\",AA31-AA54,AA31)","v":61705.08},{"$f":"IF(Benchmarking!$C$9=\"Yes\",AB31-AB54,AB31)","v":3109.72},{"$f":"IF(Benchmarking!$C$9=\"Yes\",AC31-AC54,AC31)","v":0},{"$f":"IF(Benchmarking!$C$9=\"Yes\",AD31-AD54,AD31)","v":46473.93},{"$f":"IF(Benchmarking!$C$9=\"Yes\",AE31-AE54,AE31)","v":0},{"$f":"IF(Benchmarking!$C$9=\"Yes\",AF31-AF54,AF31)","v":12873.3},{"$f":"IF(Benchmarking!$C$9=\"Yes\",AG31-AG54,AG31)","v":4428.3100000000004},{"$f":"IF(Benchmarking!$C$9=\"Yes\",AH31-AH54,AH31)","v":139.5},{"$f":"IF(Benchmarking!$C$9=\"Yes\",AI31-AI54,AI31)","v":6975.42},{"$f":"IF(Benchmarking!$C$9=\"Yes\",AJ31-AJ54,AJ31)","v":46143.59},{"$f":"IF(Benchmarking!$C$9=\"Yes\",AK31-AK54,AK31)","v":11163.54},{"$f":"IF(Benchmarking!$C$9=\"Yes\",AL31-AL54,AL31)","v":72706.42},{"$f":"IF(Benchmarking!$C$9=\"Yes\",AM31-AM54,AM31)","v":55835.77},{"$f":"IF(Benchmarking!$C$9=\"Yes\",AN31-AN54,AN31)","v":2150},{"$f":"IF(Benchmarking!$C$9=\"Yes\",AO31-AO54,AO31)","v":183689.12},{"$f":"IF(Benchmarking!$C$9=\"Yes\",AP31-AP54,AP31)","v":43758.04},{"$f":"IF(Benchmarking!$C$9=\"Yes\",AQ31-AQ54,AQ31)","v":0},{"$f":"IF(Benchmarking!$C$9=\"Yes\",AR31-AR54,AR31)","v":0},{"$f":"IF(Benchmarking!$C$9=\"Yes\",AS31-AS54,AS31)","v":0},{"$f":"IF(Benchmarking!$C$9=\"Yes\",AT31-AT54,AT31)","v":0},{"$f":"IF(Benchmarking!$C$9=\"Yes\",AU31-AU54,AU31)","v":0},{"$f":"IF(Benchmarking!$C$9=\"Yes\",AV31-AV54,AV31)","v":-2473139.21},{"$f":"IF(Benchmarking!$C$9=\"Yes\",AW31-AW54,AW31)","v":0},{"$f":"IF(Benchmarking!$C$9=\"Yes\",AX31-AX54,AX31)","v":-2860451.09},{"$f":"IF(Benchmarking!$C$9=\"Yes\",AY31-AY54,AY31)","v":0},{"$f":"IF(Benchmarking!$C$9=\"Yes\",AZ31-AZ54,AZ31)","v":-270271},{"$f":"IF(Benchmarking!$C$9=\"Yes\",BA31-BA54,BA31)","v":-9200},{"$f":"IF(Benchmarking!$C$9=\"Yes\",BB31-BB54,BB31)","v":-1976.42},{"$f":"IF(Benchmarking!$C$9=\"Yes\",BC31-BC54,BC31)","v":-7879.88},{"$f":"IF(Benchmarking!$C$9=\"Yes\",BD31-BD54,BD31)","v":-292136.49},{"$f":"IF(Benchmarking!$C$9=\"Yes\",BE31-BE54,BE31)","v":-11904.17},{"$f":"IF(Benchmarking!$C$9=\"Yes\",BF31-BF54,BF31)","v":0},{"$f":"IF(Benchmarking!$C$9=\"Yes\",BG31-BG54,BG31)","v":-2201.77},{"$f":"IF(Benchmarking!$C$9=\"Yes\",BH31-BH54,BH31)","v":-24546.5},{"$f":"IF(Benchmarking!$C$9=\"Yes\",BI31-BI54,BI31)","v":-3495.69},{"$f":"IF(Benchmarking!$C$9=\"Yes\",BJ31-BJ54,BJ31)","v":0},{"$f":"IF(Benchmarking!$C$9=\"Yes\",BK31-BK54,BK31)","v":0},{"$f":"IF(Benchmarking!$C$9=\"Yes\",BL31-BL54,BL31)","v":0},{"$f":"IF(Benchmarking!$C$9=\"Yes\",BM31-BM54,BM31)","v":-18919},{"$f":"IF(Benchmarking!$C$9=\"Yes\",BN31-BN54,BN31)","v":0},{"$f":"IF(Benchmarking!$C$9=\"Yes\",BO31-BO54,BO31)","v":0},{"$f":"IF(Benchmarking!$C$9=\"Yes\",BP31-BP54,BP31)","v":-55191.25}]
[7033,"St Anthony's School",0,0,98,105.33333333333333,98,105.33333333333333,{"$f":"IF(Benchmarking!$C$9=\"Yes\",I32-I55,I32)","v":1342681.2},{"$f":"IF(Benchmarking!$C$9=\"Yes\",J32-J55,J32)","v":0},{"$f":"IF(Benchmarking!$C$9=\"Yes\",K32-K55,K32)","v":744948.63},{"$f":"IF(Benchmarking!$C$9=\"Yes\",L32-L55,L32)","v":40731.589999999997},{"$f":"IF(Benchmarking!$C$9=\"Yes\",M32-M55,M32)","v":209220.08},{"$f":"IF(Benchmarking!$C$9=\"Yes\",N32-N55,N32)","v":43755.8},{"$f":"IF(Benchmarking!$C$9=\"Yes\",O32-O55,O32)","v":53127.76},{"$f":"IF(Benchmarking!$C$9=\"Yes\",P32-P55,P32)","v":996.76},{"$f":"IF(Benchmarking!$C$9=\"Yes\",Q32-Q55,Q32)","v":8485.4599999999991},{"$f":"IF(Benchmarking!$C$9=\"Yes\",R32-R55,R32)","v":203.68},{"$f":"IF(Benchmarking!$C$9=\"Yes\",S32-S55,S32)","v":10776.48},{"$f":"IF(Benchmarking!$C$9=\"Yes\",T32-T55,T32)","v":46039.56},{"$f":"IF(Benchmarking!$C$9=\"Yes\",U32-U55,U32)","v":6435},{"$f":"IF(Benchmarking!$C$9=\"Yes\",V32-V55,V32)","v":51668.52},{"$f":"IF(Benchmarking!$C$9=\"Yes\",W32-W55,W32)","v":4999.1899999999996},{"$f":"IF(Benchmarking!$C$9=\"Yes\",X32-X55,X32)","v":36860.49},{"$f":"IF(Benchmarking!$C$9=\"Yes\",Y32-Y55,Y32)","v":0},{"$f":"IF(Benchmarking!$C$9=\"Yes\",Z32-Z55,Z32)","v":9245.7999999999993},{"$f":"IF(Benchmarking!$C$9=\"Yes\",AA32-AA55,AA32)","v":77298.740000000005},{"$f":"IF(Benchmarking!$C$9=\"Yes\",AB32-AB55,AB32)","v":4528.29},{"$f":"IF(Benchmarking!$C$9=\"Yes\",AC32-AC55,AC32)","v":4951.62},{"$f":"IF(Benchmarking!$C$9=\"Yes\",AD32-AD55,AD32)","v":3042.08},{"$f":"IF(Benchmarking!$C$9=\"Yes\",AE32-AE55,AE32)","v":4869.75},{"$f":"IF(Benchmarking!$C$9=\"Yes\",AF32-AF55,AF32)","v":1220},{"$f":"IF(Benchmarking!$C$9=\"Yes\",AG32-AG55,AG32)","v":5100.01},{"$f":"IF(Benchmarking!$C$9=\"Yes\",AH32-AH55,AH32)","v":2628.8},{"$f":"IF(Benchmarking!$C$9=\"Yes\",AI32-AI55,AI32)","v":3765.76},{"$f":"IF(Benchmarking!$C$9=\"Yes\",AJ32-AJ55,AJ32)","v":7284.74},{"$f":"IF(Benchmarking!$C$9=\"Yes\",AK32-AK55,AK32)","v":5409.07},{"$f":"IF(Benchmarking!$C$9=\"Yes\",AL32-AL55,AL32)","v":12098},{"$f":"IF(Benchmarking!$C$9=\"Yes\",AM32-AM55,AM32)","v":49138.05},{"$f":"IF(Benchmarking!$C$9=\"Yes\",AN32-AN55,AN32)","v":0.13},{"$f":"IF(Benchmarking!$C$9=\"Yes\",AO32-AO55,AO32)","v":203391.08},{"$f":"IF(Benchmarking!$C$9=\"Yes\",AP32-AP55,AP32)","v":36515.410000000003},{"$f":"IF(Benchmarking!$C$9=\"Yes\",AQ32-AQ55,AQ32)","v":0},{"$f":"IF(Benchmarking!$C$9=\"Yes\",AR32-AR55,AR32)","v":0},{"$f":"IF(Benchmarking!$C$9=\"Yes\",AS32-AS55,AS32)","v":35000},{"$f":"IF(Benchmarking!$C$9=\"Yes\",AT32-AT55,AT32)","v":0},{"$f":"IF(Benchmarking!$C$9=\"Yes\",AU32-AU55,AU32)","v":0},{"$f":"IF(Benchmarking!$C$9=\"Yes\",AV32-AV55,AV32)","v":-1099005.98},{"$f":"IF(Benchmarking!$C$9=\"Yes\",AW32-AW55,AW32)","v":0},{"$f":"IF(Benchmarking!$C$9=\"Yes\",AX32-AX55,AX32)","v":-1597480.96},{"$f":"IF(Benchmarking!$C$9=\"Yes\",AY32-AY55,AY32)","v":0},{"$f":"IF(Benchmarking!$C$9=\"Yes\",AZ32-AZ55,AZ32)","v":-122685.38},{"$f":"IF(Benchmarking!$C$9=\"Yes\",BA32-BA55,BA32)","v":-63356.93},{"$f":"IF(Benchmarking!$C$9=\"Yes\",BB32-BB55,BB32)","v":-57647.31},{"$f":"IF(Benchmarking!$C$9=\"Yes\",BC32-BC55,BC32)","v":-11900},{"$f":"IF(Benchmarking!$C$9=\"Yes\",BD32-BD55,BD32)","v":-937.79},{"$f":"IF(Benchmarking!$C$9=\"Yes\",BE32-BE55,BE32)","v":-4818.72},{"$f":"IF(Benchmarking!$C$9=\"Yes\",BF32-BF55,BF32)","v":0},{"$f":"IF(Benchmarking!$C$9=\"Yes\",BG32-BG55,BG32)","v":-9569.58},{"$f":"IF(Benchmarking!$C$9=\"Yes\",BH32-BH55,BH32)","v":-50},{"$f":"IF(Benchmarking!$C$9=\"Yes\",BI32-BI55,BI32)","v":-7481.78},{"$f":"IF(Benchmarking!$C$9=\"Yes\",BJ32-BJ55,BJ32)","v":0},{"$f":"IF(Benchmarking!$C$9=\"Yes\",BK32-BK55,BK32)","v":0},{"$f":"IF(Benchmarking!$C$9=\"Yes\",BL32-BL55,BL32)","v":0},{"$f":"IF(Benchmarking!$C$9=\"Yes\",BM32-BM55,BM32)","v":-16318},{"$f":"IF(Benchmarking!$C$9=\"Yes\",BN32-BN55,BN32)","v":0},{"$f":"IF(Benchmarking!$C$9=\"Yes\",BO32-BO55,BO32)","v":0},{"$f":"IF(Benchmarking!$C$9=\"Yes\",BP32-BP55,BP32)","v":-26767.5}]
{"$rows_left_out":67}