{"text_format":"1","workbook":"xlsx","n_sheets":3,"sheets":["Mainstream","Special & PRU","DATA"],"not_rendered":{"charts":0,"images":0,"macros":0,"external_links":0,"defined_names":3,"comments":0,"pivot_tables":0},"unopened":[],"bounds":{"document_bytes":16777216,"sheet_cells":100000,"rows_first":2000,"rows_last":500,"rows_between":2000,"halvings":0,"cell_chars":16384,"cell_head_chars":4096},"cells_cut":0,"cells_raw":0,"read":"whole","date_system":"1900"}

{"sheet":"Mainstream","index":0,"n_rows":32,"n_cols":16,"rows_kept":32,"cut":false,"hidden":false,"merged":[[10,3,10,4],[10,6,10,15]]}
[]
[null,"NOTES:","Please populate the shaded boxes first"]
[null,null,"The accuracy of the estimated supplementary grant is reliant on the template being completed correctly and the current guidance of how the ESFA will calculate the grant"]
[null,null,"Accordingly to the above the final grant payment may differ somewhat"]
[null,null,"The total allocation in column E will be paid in the November school advance"]
[null,null,"Schools who anticipate a supplementary grant payment must apply directly to the ESFA between 02/12/19 and 17/01/20 for payment in March 2020"]
[null,null,"Pupils numbers are taken from the October 2018 census"]
[]
[null,"DFE",null,null,{"$f":"IFERROR(VLOOKUP(C9,DATA!A:B,2,0),\"\")","v":""}]
[]
[null,null,null,"TEACHERS' PENSION EMPLOYER CONTRIBUTION GRANT REVENUE ALLOCATIONS SEPTEMBER 2019 to MARCH 2020 ",null,null,"Potential claim of supplementary grant funding"]
[]
[null,null,null,"Primary Pupils",{"$f":"IFERROR(VLOOKUP($C$9,DATA!$A:$I,3,0),0)","v":0},null,"Actual cost of teachers pension employer contributions November 2019"]
[null,null,null,"Primary Rate",{"$f":"IFERROR(VLOOKUP($C$9,DATA!$A:$I,4,0),0)","v":0}]
[null,null,null,"Primary Allocation",{"$f":"IFERROR(VLOOKUP($C$9,DATA!$A:$I,5,0),0)","v":0},null,"Additional cost from above attributable to rate increase",null,null,null,null,null,null,null,null,{"$f":"IFERROR(P13-((P13/0.2368)*0.1648),0)","v":0}]
[]
[null,null,null,"Secondary Pupils",{"$f":"IFERROR(VLOOKUP($C$9,DATA!$A:$I,6,0),0)","v":0},null,"7 Month additional cost figure used for calculation",null,null,null,null,null,null,null,null,{"$f":"IFERROR(P15*7,0)","v":0}]
[null,null,null,"Secondary Rate",{"$f":"IFERROR(VLOOKUP($C$9,DATA!$A:$I,7,0),0)","v":0}]
[null,null,null,"Secondary Allocation",{"$f":"IFERROR(VLOOKUP($C$9,DATA!$A:$I,8,0),0)","v":0},null,"Less grant allocation already made",null,null,null,null,null,null,null,null,{"$f":"E21","v":0}]
[]
[null,null,null,"Total Allocation",{"$f":"IFERROR(VLOOKUP($C$9,DATA!$A:$I,9,0),0)","v":0},"A","Remaining cost to school",null,null,null,null,null,null,null,null,{"$f":"IFERROR(P17-P19,0)","v":0}]
[]
[null,null,null,null,null,null,null,"Additional cost threshold"]
[]
[null,null,null,null,null,null,null,"Individual budget share after de-delegation",null,null,null,null,null,null,null,{"$f":"IFERROR(VLOOKUP(C9,DATA!A:K,11,0),0)","v":0}]
[null,null,null,null,null,null,null,"School sixth form funding",null,null,null,null,null,null,null,0]
[null,null,null,null,null,null,null,"Teachers Pay Grant",null,null,null,null,null,null,null,{"$f":"IFERROR(VLOOKUP(C9,DATA!A:J,10,0),0)","v":0}]
[null,null,null,null,null,null,null,"Subtotal",null,null,null,null,null,null,null,{"$f":"P27+P26+P25","v":0}]
[null,null,null,null,null,null,null,"Pro rata for 7 months",null,null,null,null,null,null,null,{"$f":"ROUND(P28*(7/12),0)","v":0}]
[null,null,null,null,null,"B",null,"0.05% threshold",null,null,null,null,null,null,null,{"$f":"P29*0.0005","v":0}]
[]
[null,null,null,null,null,null,"Estimated supplementary grant based on above figures (A-B)",null,null,null,null,null,null,null,null,{"$f":"IF(P21>P30,P21-P30,0)","v":0}]

{"sheet":"Special & PRU","index":1,"n_rows":32,"n_cols":16,"rows_kept":32,"cut":false,"hidden":false,"merged":[[10,3,10,4],[10,6,10,15]]}
[]
[null,"NOTES:","Please populate the shaded boxes first"]
[null,null,"The total allocation in column E will be paid in the November school advance"]
[null,null,"After the November payroll is completed please forward confirmation of your total teachers pension employer contribution costs"]
[null,null,"KCC is then required to apply for the Supplementary Grant on behalf of all special schools and PRUs maintained and academy"]
[null,null,"In January a second payment will be made for the additional allocation in column P this will be based on our best estimate of each schools whole year budget at that time"]
[null,null,"In the event that the total of the payments made to schools are in excess of the final grant payment made by the ESFA there will be no retrospective adjustments to payments made"]
[]
[null,"DFE",null,null,{"$f":"IFERROR(VLOOKUP(C9,DATA!A:B,2,0),\"\")","v":""}]
[]
[null,null,null,"TEACHERS' PENSION EMPLOYER CONTRIBUTION GRANT REVENUE ALLOCATIONS SEPTEMBER 2019 to MARCH 2020 ",null,null,"Estimated payment of further funding"]
[]
[null,null,null,"Number of places used for calculation",{"$f":"IFERROR(VLOOKUP($C$9,DATA!$A:$N,12,0),0)","v":0},null,"Actual cost of teachers pension employer contributions November 2019"]
[null,null,null,"Rate Used for Calculation",{"$f":"IFERROR(VLOOKUP($C$9,DATA!$A:$N,13,0),0)","v":0}]
[null,null,null,"Initial allocation",{"$f":"IFERROR(VLOOKUP($C$9,DATA!$A:$N,14,0),0)","v":0},null,"Additional cost from above attributable to rate increase",null,null,null,null,null,null,null,null,{"$f":"IFERROR(P13-((P13/0.2368)*0.1648),0)","v":0}]
[]
[null,null,null,"4/7 Allocation",{"$f":"IFERROR(VLOOKUP($C$9,DATA!$A:$I,9,0),0)","v":0},null,"7 Month additional cost figure used for calculation",null,null,null,null,null,null,null,null,{"$f":"IFERROR(P15*7,0)","v":0}]
[]
[null,null,null,null,null,null,"Less grant allocation already made",null,null,null,null,null,null,null,null,{"$f":"E17","v":0}]
[]
[null,null,null,null,null,"A","Remaining cost to school",null,null,null,null,null,null,null,null,{"$f":"IFERROR(P17-P19,0)","v":0}]
[]
[null,null,null,null,null,null,null,"Additional cost threshold"]
[]
[null,null,null,null,null,null,null,"Place Funding"]
[null,null,null,null,null,null,null,"Element 3 top-up funding"]
[null,null,null,null,null,null,null,"Teachers Pay Grant",null,null,null,null,null,null,null,{"$f":"IFERROR(VLOOKUP(C9,DATA!A:J,10,0),0)","v":0}]
[null,null,null,null,null,null,null,"Subtotal",null,null,null,null,null,null,null,{"$f":"P27+P26+P25","v":0}]
[null,null,null,null,null,null,null,"Pro rata for 7 months",null,null,null,null,null,null,null,{"$f":"ROUND(P28*(7/12),0)","v":0}]
[null,null,null,null,null,"B",null,"0.05% threshold",null,null,null,null,null,null,null,{"$f":"P29*0.0005","v":0}]
[]
[null,null,null,null,null,null,"Estimated supplementary allocation (A-B)",null,null,null,null,null,null,null,null,{"$f":"IF(P21>P30,P21-P30,0)","v":0}]

{"sheet":"DATA","index":2,"n_rows":334,"n_cols":14,"rows_kept":334,"cut":false,"hidden":true,"merged":[]}
["DFE","School","Primary Pupils","Primary Rate","Primary Allocation","Secondary Pupils","Secondary Rate","Secondary Allocation","Allocation","TPG","Post de-delegation budget in APT","HN Places","HN Rate","7/7 Allocation"]
[1001,"Northfleet Nursery School",115,77.5,8912.5,0,114.08,0,8913,7065,0]
[2000,"St Johns Church of England Primary School",346,77.5,26815,0,114.08,0,26815,27067,1329710.8266723948]
[2002,"Repton Manor Primary School",481,77.5,37277.5,0,114.08,0,37278,16088,1637283.0237026]
[2065,"The Discovery School",621,77.5,48127.5,0,114.08,0,48128,19047,2172081.1449465998]
[2066,"Maypole Primary School",406,79.849999999999994,32419.1,0,117.53,0,32419,21960,1482291.946495817]
[2074,"Sunny Bank Primary School",315,77.5,24412.5,0,114.08,0,24413,35040,1171922.0574544743]
[2079,"Woodlands Primary School",644,77.5,49910,0,114.08,0,49910,18639,2233388.5577223999]
[2088,"Crockenhill Primary School",202,79.849999999999994,16129.699999999999,0,117.53,0,16130,20814,774660.23868468963]
[2089,"The Anthony Roper Primary School",304,79.849999999999994,24274.399999999998,0,117.53,0,24274,20450,1068174.6850728928]
[2094,"Cobham Primary School",220,77.5,17050,0,114.08,0,17050,11881,774634.04088338651]
[2095,"Cecil Road Primary and Nursery School",444,77.5,34410,0,114.08,0,34410,13606,1404782.224613548]
[2109,"Higham Primary School",211,77.5,16352.5,0,114.08,0,16353,11277,769337.12082157494]
[2116,"Lawn Primary School",232,77.5,17980,0,114.08,0,17980,18283,913694.7614964915]
[2119,"Shears Green Infant School",359,77.5,27822.5,0,114.08,0,27823,17938,1270873.667493867]
[2120,"Bean Primary School",197,79.849999999999994,15730.449999999999,0,117.53,0,15730,10073,794947.44786175864]
[2128,"Capel Primary School",209,77.5,16197.5,0,114.08,0,16198,8115,756000.25298137369]
[2130,"Dunton Green Primary School",168,79.849999999999994,13414.8,0,117.53,0,13415,24118,704570.14564808866]
[2132,"Hadlow Primary School",202,77.5,15655,0,114.08,0,15655,18540,790869.28600786068]
[2133,"Halstead Community Primary School",100,79.849999999999994,7984.9999999999991,0,117.53,0,7985,16775,409285.88267703628]
[2134,"Four Elms Primary School",110,79.849999999999994,8783.5,0,117.53,0,8784,11075,487427.8106906187]
[2136,"Kemsing Primary School",198,79.849999999999994,15810.3,0,117.53,0,15810,20788,767572.20370482199]
[2137,"Leigh Primary School",172,79.849999999999994,13734.199999999999,0,117.53,0,13734,16934,661517.74455661664]
[2138,"Otford Primary School",390,79.849999999999994,31141.499999999996,0,117.53,0,31142,9739,1344601.1741881417]
[2139,"Pembury School",442,77.5,34255,0,114.08,0,34255,15129,1533282.4542131999]
[2142,"Sandhurst Primary School",143,77.5,11082.5,0,114.08,0,11083,27020,580572.90079943929]
[2147,"Weald Community Primary School",170,79.849999999999994,13574.499999999998,0,117.53,0,13575,22150,663117.17174921336]
[2148,"Shoreham Village School",100,79.849999999999994,7984.9999999999991,0,117.53,0,7985,20814,440335.13096501585]
[2155,"Slade Primary School and Attached Unit for Children with Hearing Impairment",389,77.5,30147.5,0,114.08,0,30148,12317,1345468.3725994001]
[2156,"Sussex Road Community Primary School",448,77.5,34720,0,114.08,0,34720,14728,1558917.3879807999]
[2161,"Boughton Monchelsea Primary School",208,77.5,16120,0,114.08,0,16120,20576,778791.52022241708]
[2163,"East Farleigh Primary School",200,77.5,15500,0,114.08,0,15500,24203,729425.78289624618]
[2164,"East Peckham Primary School",158,77.5,12245,0,114.08,0,12245,21865,623508.29438730294]
[2165,"Headcorn Primary School",254,77.5,19685,0,114.08,0,19685,26208,917007.86282839999]
[2166,"Hollingbourne Primary School",100,77.5,7750,0,114.08,0,7750,14655,426370.84095959779]
[2167,"Ightham Primary School",201,77.5,15577.5,0,114.08,0,15578,46068,724202.57489986694]
[2168,"Lenham Primary School",205,77.5,15887.5,0,114.08,0,15888,44445,759040.89154605661]
[2169,"Platts Heath Primary School",100,77.5,7750,0,114.08,0,7750,29263,335265.6554850064]
[2171,"Brunswick House Primary School",418.5,77.5,32433.75,0,114.08,0,32434,44492,1480779.0414374]
[2175,"North Borough Junior School",336,77.5,26040,0,114.08,0,26040,24394,1238847.241717255]
[2176,"Park Way Primary School",310,77.5,24025,0,114.08,0,24025,21578,1204520.280004519]
[2183,"Marden Primary School",283,77.5,21932.5,0,114.08,0,21933,21625,1068539.6165620058]
[2185,"Mereworth Community Primary School",209,77.5,16197.5,0,114.08,0,16198,17256,783238.04745943111]
[2187,"Offham Primary School",210,77.5,16275,0,114.08,0,16275,22055,754551.62206610374]
[2188,"Plaxtol Primary School",100,77.5,7750,0,114.08,0,7750,15691,404768.55935532443]
[2189,"Ryarsh Primary School",209,77.5,16197.5,0,114.08,0,16198,17758,744966.57214027678]
[2190,"Shipbourne School",100,77.5,7750,0,114.08,0,7750,7665,300798.04010839888]
[2191,"St Katherine's School",630,77.5,48825,0,114.08,0,48825,9792,2040611.3238820466]
[2192,"Staplehurst School",385.5,77.5,29876.25,0,114.08,0,29876,25061,1341454.4057155999]
[2193,"Sutton Valence Primary School",183,77.5,14182.5,0,114.08,0,14183,6582,699142.74580128049]
[2226,"Eastling Primary School",100,77.5,7750,0,114.08,0,7750,7705,431007.08284770121]
[2227,"Ethelbert Road Primary School",209,77.5,16197.5,0,114.08,0,16198,16855,757766.17028466274]
[2228,"Davington Primary School",409,77.5,31697.5,0,114.08,0,31698,18522,1499896.9689361383]
[2231,"Lower Halstow Primary School",149,77.5,11547.5,0,114.08,0,11548,18299,592035.31861210987]
[2237,"Queenborough School and Nursery",499,77.5,38672.5,0,114.08,0,38673,20241,1695175.5787202935]
[2239,"Rodmersham School",100,77.5,7750,0,114.08,0,7750,9250,421673.29033025046]
[2245,"Rose Street Primary School",385,77.5,29837.5,0,114.08,0,29838,9270,1552041.4258321798]
[2254,"Canterbury Road Primary School",210,77.5,16275,0,114.08,0,16275,17281,876318.01554425096]
[2258,"Blean Primary School",433,77.5,33557.5,0,114.08,0,33558,20909,1498125.5535617999]
[2259,"Chartham Primary School",346,77.5,26815,0,114.08,0,26815,31269,1216716.9163717462]
[2263,"Herne Bay Infant School",390,77.5,30225,0,114.08,0,30225,18522,1273523.0693999254]
[2265,"Hoath Primary School",100,77.5,7750,0,114.08,0,7750,30075,403918.97075832979]
[2268,"Westmeads Community Infant School",177,77.5,13717.5,0,114.08,0,13718,8507,676422.99087875197]
[2269,"Whitstable Junior School",276,77.5,21390,0,114.08,0,21390,20025,1016289.3684311819]
[2270,"Aldington Primary School",197,77.5,15267.5,0,114.08,0,15268,10311,729820.79675693379]
[2272,"East Stour Primary School",453,77.5,35107.5,0,114.08,0,35108,10354,1558202.9771704082]
[2275,"Victoria Road Primary School",211,77.5,16352.5,0,114.08,0,16353,16654,822423.91257912735]
[2276,"Willesborough Infant School",367,77.5,28442.5,0,114.08,0,28443,12862,1302233.0140141787]
[2278,"Bethersden Primary School",129,77.5,9997.5,0,114.08,0,9998,15571,540461.56390248809]
[2279,"Brook Community Primary School",100,77.5,7750,0,114.08,0,7750,15372,426739.96207824023]
[2280,"Challock Primary School",212,77.5,16430,0,114.08,0,16430,14447,765617.78831876849]
[2282,"Great Chart Primary School",483,77.5,37432.5,0,114.08,0,37433,16947,1667763.6682918]
[2285,"Mersham Primary School",196,77.5,15190,0,114.08,0,15190,14968,711897.77686437289]
[2287,"Rolvenden Primary School",104,77.5,8060,0,114.08,0,8060,4013,478266.86070302321]
[2289,"Smeeth Community Primary School",132,77.5,10230,0,114.08,0,10230,24346,530555.90909742692]
[2296,"Mundella Primary School",207,77.5,16042.5,0,114.08,0,16043,14968,918233.38297373452]
[2298,"Hawkinge Primary School",382,77.5,29605,0,114.08,0,29605,20667,1346590.0366551175]
[2300,"Sellindge Primary School",103,77.5,7982.5,0,114.08,0,7983,27690,443129.25738453376]
[2312,"River Primary School",426,77.5,33015,0,114.08,0,33015,16855,1495090.2029891114]
[2318,"Langdon Primary School",100,77.5,7750,0,114.08,0,7750,8347,387955.31881742942]
[2320,"Eythorne Elvington Community Primary School",111,77.5,8602.5,0,114.08,0,8603,6661,525029.46558350022]
[2321,"Lydden Primary School",100,77.5,7750,0,114.08,0,7750,9631,379140.1196783763]
[2322,"Preston Primary School",126,77.5,9765,0,114.08,0,9765,16694,516031.17847980099]
[2326,"Wingham Primary School",211,77.5,16352.5,0,114.08,0,16353,20868,786919.46342281369]
[2327,"Worth Primary School",100,77.5,7750,0,114.08,0,7750,17577,316626.06381890172]
[2328,"St Mildred's Primary Infant School",270,77.5,20925,0,114.08,0,20925,27497,979814.70079285465]
[2329,"Callis Grange Nursery and Infant School",294,77.5,22785,0,114.08,0,22785,9391,1014622.863955741]
[2337,"St Crispin's Community Primary Infant School",269,77.5,20847.5,0,114.08,0,20848,12520,955083.33347582538]
[2340,"Ellington Infant School",175,77.5,13562.5,0,114.08,0,13563,24198,756801.50415954401]
[2345,"Priory Infant School",177,77.5,13717.5,0,114.08,0,13718,9468,751917.612934303]
[2431,"Shears Green Junior School",479,77.5,37122.5,0,114.08,0,37123,22652,1674694.8723395669]
[2434,"West Minster Primary School",493,77.5,38207.5,0,114.08,0,38208,18902,1892935.1056275533]
[2454,"Aycliffe Community Primary School",116,77.5,8990,0,114.08,0,8990,16213,572463.87241697591]
[2459,"Riverhead Infants' School",269,79.849999999999994,21479.649999999998,0,117.53,0,21480,21243,967279.27225009596]
[2465,"Claremont Primary School",465,77.5,36037.5,0,114.08,0,36038,18781,1607111.866989]
[2471,"Whitfield Aspen School",488,77.5,37820,0,114.08,0,37820,38047,1826100.4527790884]
[2474,"St Paul's Infant School",262,77.5,20305,0,114.08,0,20305,18781,1018526.2283843114]
[2482,"Langton Green Primary School",389,77.5,30147.5,0,114.08,0,30148,18580,1351167.3725994001]
[2490,"Bishops Down Primary School",299,77.5,23172.5,0,114.08,0,23173,9672,964190.32456571562]
[2509,"Singlewell Primary School",294,77.5,22785,0,114.08,0,22785,8588,1109572.8859043976]
[2510,"Cheriton Primary School",452,77.5,35030,0,114.08,0,35030,25844,1613450.5491627823]
[2514,"Brookfield Infant School",177,77.5,13717.5,0,114.08,0,13718,15229,702868.89571818919]
[2519,"Vigo Village School",188,77.5,14570,0,114.08,0,14570,6421,711705.80059456814]
[2520,"Madginford Primary School",642,77.5,49755,0,114.08,0,49755,14086,2226196.9131331998]
[2524,"Palmarsh Primary School",147,77.5,11392.5,0,114.08,0,11393,10153,617857.72564226843]
[2525,"Painters Ash Primary School",407,77.5,31542.5,0,114.08,0,31543,16333,1485156.9072305697]
[2530,"Tunbury Primary School",593,77.5,45957.5,0,114.08,0,45958,9270,2049958.1206978001]
[2532,"St Margaret's-at-Cliffe Primary School",194,77.5,15035,0,114.08,0,15035,17855,718551.29517267656]
[2534,"Bysing Wood Primary School",157,77.5,12167.5,0,114.08,0,12168,4068,776840.68391316093]
[2539,"Stocks Green Primary School",217,77.5,16817.5,0,114.08,0,16818,20241,763556.07089295844]
[2545,"Sandgate Primary School",426,77.5,33015,0,114.08,0,33015,22198,1484532.2974996001]
[2552,"Sandling Primary School",423,77.5,32782.5,0,114.08,0,32783,22867,1462212.3306158001]
[2559,"Capel-le-Ferne Primary School",208,77.5,16120,0,114.08,0,16120,8347,791354.77701331023]
[2562,"Lunsford Primary School",207,77.5,16042.5,0,114.08,0,16043,21673,764691.06089734333]
[2569,"Briary Primary School",365,77.5,28287.5,0,114.08,0,28288,16899,1284464.2823844706]
[2574,"Downs View Infant School",258,77.5,19995,0,114.08,0,19995,10354,945984.25727181043]
[2578,"Kingswood Primary School",110,77.5,8525,0,114.08,0,8525,25135,451831.84955879929]
[2586,"Senacre Wood Primary School",206,77.5,15965,0,114.08,0,15965,8267,839299.49545063253]
[2603,"Bromstone Primary School, Broadstairs",484,77.5,37510,0,114.08,0,37510,21243,1814739.2960680027]
[2607,"Parkside Community Primary School",100,77.5,7750,0,114.08,0,7750,10216,550940.71727815911]
{"$rows_left_out":214}