{"text_format":"1","workbook":"xlsx","n_sheets":3,"sheets":["Special Rates 2018-19","Nursery Lump Sums","newdatacalc"],"not_rendered":{"charts":0,"images":1,"macros":1,"external_links":0,"defined_names":24,"comments":1,"pivot_tables":0},"unopened":[],"bounds":{"document_bytes":16777216,"sheet_cells":100000,"rows_first":2000,"rows_last":500,"rows_between":2000,"halvings":0,"cell_chars":16384,"cell_head_chars":4096},"cells_cut":0,"cells_raw":0,"read":"whole","date_system":"1900"}

{"sheet":"Special Rates 2018-19","index":0,"n_rows":96,"n_cols":28,"rows_kept":96,"cut":false,"hidden":false,"merged":[[1,15,2,19],[80,1,80,4],[81,1,81,4],[82,1,82,4],[88,9,88,13],[74,1,74,4],[58,1,58,8],[59,1,59,8],[60,1,60,8],[61,1,61,8],[69,1,69,4],[70,1,70,4],[71,1,71,4],[72,1,72,4],[73,1,73,4],[66,9,66,13],[7,4,7,10],[30,1,30,6],[4,16,12,20],[33,1,33,6],[22,9,22,13],[22,16,22,20],[12,7,19,10],[26,1,26,7],[28,1,28,7],[94,6,94,9],[22,23,22,27],[88,16,88,20],[88,23,88,27],[66,16,66,20],[46,16,46,20],[46,23,46,27],[66,23,66,27],[75,1,75,4],[76,1,76,4],[77,1,77,4],[78,1,78,4],[79,1,79,4],[68,1,68,4],[52,1,52,8],[53,1,53,8],[54,1,54,8],[55,1,55,8],[56,1,56,8],[57,1,57,8],[95,6,95,12],[37,6,37,8],[38,6,38,8],[39,6,39,8],[40,6,40,8],[42,6,42,8],[43,6,43,8],[44,6,44,8],[46,9,46,13],[48,1,48,8],[50,1,50,8],[49,1,49,8],[95,1,95,4],[51,1,51,8],[90,1,90,8],[94,1,94,4]]}
[]
[]
[]
[null,null,null,null,"2018/19 Calculation of Special School Funding Rates"]
[]
[]
[]
[null,"DfE",null,null,{"$f":"IFERROR(VLOOKUP(DFENUM,newdatacalc!$A$33:$CB$55,2,0),\"\")","v":""}]
[]
[]
[null,"Section 1 - Commissioned Place numbers"]
[]
[null,"Academic Year","Pre-16","Post-16","Weekday Residential","Weekend Residential",null,"High Needs Place numbers as agreed annually with the Local Authority's SEN team.\n\nPlace numbers 2017-18 agreed November 2016\n\n\nPlace numbers 2018-19 agreed November 2017"]
[]
[null,"2017/18",{"$f":"IFERROR(VLOOKUP(DFENUM,newdatacalc!$A$33:$CL$55,81,0),0)","v":0},{"$f":"IFERROR(VLOOKUP(DFENUM,newdatacalc!$A$33:$CL$55,82,0),0)","v":0},{"$f":"IFERROR(VLOOKUP(DFENUM,newdatacalc!$A$33:$CL$55,83,0),0)","v":0},{"$f":"IFERROR(VLOOKUP(DFENUM,newdatacalc!$A$33:$CL$55,84,0),0)","v":0}]
[]
[null,"2018/19",{"$f":"IFERROR(VLOOKUP(DFENUM,newdatacalc!$A$33:$CL$55,79,0),0)","v":0},{"$f":"IFERROR(VLOOKUP(DFENUM,newdatacalc!$A$33:$CL$55,80,0),0)","v":0},{"$f":"IFERROR(VLOOKUP(DFENUM,newdatacalc!$A$33:$CL$55,77,0),0)","v":0},{"$f":"IFERROR(VLOOKUP(DFENUM,newdatacalc!$A$33:$CL$55,78,0),0)","v":0}]
[]
[null,"Movement",{"$f":"C17-C15","v":0},{"$f":"D17-D15","v":0},{"$f":"E17-E15","v":0},{"$f":"F17-F15","v":0}]
[]
[]
[]
[null,null,null,null,null,null,null,null,null,"Day Pupil",null,null,null,null,null,null,"Weekday",null,null,null,null,null,null,"Weekend"]
[null,"Section 2 - Calculation of funding rate for April 2018 to March 2019"]
[null,null,null,null,null,null,null,null,null,"MLD & SLCN","BESD","SLD","PD & PMLD","ASD",null,null,"MLD & SLCN","BESD","SLD","PD & PMLD","ASD",null,null,"MLD & SLCN","BESD","SLD","PD & PMLD","ASD"]
[]
["(A)","April 2018 to August 2018 (Formula only excluding MFG)- based on  Academic Year 2017 to 2018. Data taken from 2017-18 Funding Rates Calculation.",null,null,null,null,null,null,null,{"$f":"IFERROR(VLOOKUP('Special Rates 2018-19'!DFENUM,newdatacalc!$A$33:$BC$55,41,0),0)","v":0},{"$f":"IFERROR(VLOOKUP('Special Rates 2018-19'!DFENUM,newdatacalc!$A$33:$BC$55,42,0),0)","v":0},{"$f":"IFERROR(VLOOKUP('Special Rates 2018-19'!DFENUM,newdatacalc!$A$33:$BC$55,43,0),0)","v":0},{"$f":"IFERROR(VLOOKUP('Special Rates 2018-19'!DFENUM,newdatacalc!$A$33:$BC$55,44,0),0)","v":0},{"$f":"IFERROR(VLOOKUP('Special Rates 2018-19'!DFENUM,newdatacalc!$A$33:$BC$55,45,0),0)","v":0},null,null,{"$f":"VLOOKUP('Special Rates 2018-19'!DFENUM,newdatacalc!$A$33:$BC$55,46,0)","v":{"$error":"#N/A"}},{"$f":"VLOOKUP('Special Rates 2018-19'!DFENUM,newdatacalc!$A$33:$BC$55,47,0)","v":{"$error":"#N/A"}},{"$f":"VLOOKUP('Special Rates 2018-19'!DFENUM,newdatacalc!$A$33:$BC$55,48,0)","v":{"$error":"#N/A"}},{"$f":"VLOOKUP('Special Rates 2018-19'!DFENUM,newdatacalc!$A$33:$BC$55,49,0)","v":{"$error":"#N/A"}},{"$f":"VLOOKUP('Special Rates 2018-19'!DFENUM,newdatacalc!$A$33:$BC$55,50,0)","v":{"$error":"#N/A"}},null,null,{"$f":"VLOOKUP('Special Rates 2018-19'!DFENUM,newdatacalc!$A$33:$BC$55,51,0)","v":{"$error":"#N/A"}},{"$f":"VLOOKUP('Special Rates 2018-19'!DFENUM,newdatacalc!$A$33:$BC$55,52,0)","v":{"$error":"#N/A"}},{"$f":"VLOOKUP('Special Rates 2018-19'!DFENUM,newdatacalc!$A$33:$BC$55,53,0)","v":{"$error":"#N/A"}},{"$f":"VLOOKUP('Special Rates 2018-19'!DFENUM,newdatacalc!$A$33:$BC$55,54,0)","v":{"$error":"#N/A"}},{"$f":"VLOOKUP('Special Rates 2018-19'!DFENUM,newdatacalc!$A$33:$BC$55,55,0)","v":{"$error":"#N/A"}}]
[]
["(B)","September 2018 to March 2019 (Formula only excluding MFG)- based on  Academic Year 2018 to 2019. See section 3 for calculation.",null,null,null,null,null,null,null,{"$f":"J91","v":9128.0078132573672},{"$f":"K91","v":11039.860388627309},{"$f":"L91","v":12995.848063983196},19441.579768500109,14949.829600127208,null,null,{"$f":"Q91","v":{"$error":"#N/A"}},{"$f":"R91","v":{"$error":"#N/A"}},{"$error":"#N/A"},{"$error":"#N/A"},{"$error":"#N/A"},null,null,{"$f":"X91","v":{"$error":"#N/A"}},{"$f":"Y91","v":{"$error":"#N/A"}},{"$error":"#N/A"},{"$error":"#N/A"},{"$error":"#N/A"}]
[]
["(C)","April 2018 to March 2019 - based on Academic Year 2017 to 2018 (April 2018 to August 2018) 5/12's + Academic Year 2018 to 2019 (September 2018 to March 2019) 7/12's",null,null,null,null,null,null,"=  (A) X 5/12 \n           + \n    (B) X 7/12",{"$f":"(J27*5/12)+(J29*7/12)","v":5324.671224400131},{"$f":"(K27*5/12)+(K29*7/12)","v":6439.9185600325973},{"$f":"(L27*5/12)+(L29*7/12)","v":7580.9113706568642},{"$f":"(M27*5/12)+(M29*7/12)","v":11340.921531625063},{"$f":"(N27*5/12)+(N29*7/12)","v":8720.7339334075386},null,null,{"$f":"(Q27*5/12)+(Q29*7/12)","v":{"$error":"#N/A"}},{"$f":"(R27*5/12)+(R29*7/12)","v":{"$error":"#N/A"}},{"$f":"(S27*5/12)+(S29*7/12)","v":{"$error":"#N/A"}},{"$f":"(T27*5/12)+(T29*7/12)","v":{"$error":"#N/A"}},{"$f":"(U27*5/12)+(U29*7/12)","v":{"$error":"#N/A"}},null,null,{"$f":"(X27*5/12)+(X29*7/12)","v":{"$error":"#N/A"}},{"$f":"(Y27*5/12)+(Y29*7/12)","v":{"$error":"#N/A"}},{"$f":"(Z27*5/12)+(Z29*7/12)","v":{"$error":"#N/A"}},{"$f":"(AA27*5/12)+(AA29*7/12)","v":{"$error":"#N/A"}},{"$f":"(AB27*5/12)+(AB29*7/12)","v":{"$error":"#N/A"}}]
[]
["(D-input)","Final funding rate for financial Year 2017 to 2018",null,null,null,null,null,null,null,{"$f":"IFERROR(VLOOKUP('Special Rates 2018-19'!DFENUM,newdatacalc!$A$33:$BV$55,58,0),0)","v":0},{"$f":"IFERROR(VLOOKUP('Special Rates 2018-19'!DFENUM,newdatacalc!$A$33:$BV$55,59,0),0)","v":0},{"$f":"IFERROR(VLOOKUP('Special Rates 2018-19'!DFENUM,newdatacalc!$A$33:$BV$55,60,0),0)","v":0},{"$f":"IFERROR(VLOOKUP('Special Rates 2018-19'!DFENUM,newdatacalc!$A$33:$BV$55,61,0),0)","v":0},{"$f":"IFERROR(VLOOKUP('Special Rates 2018-19'!DFENUM,newdatacalc!$A$33:$BV$55,62,0),0)","v":0},null,null,{"$f":"VLOOKUP('Special Rates 2018-19'!DFENUM,newdatacalc!$A$33:$BV$55,63,0)","v":{"$error":"#N/A"}},{"$f":"VLOOKUP('Special Rates 2018-19'!DFENUM,newdatacalc!$A$33:$BV$55,64,0)","v":{"$error":"#N/A"}},{"$f":"VLOOKUP('Special Rates 2018-19'!DFENUM,newdatacalc!$A$33:$BV$55,65,0)","v":{"$error":"#N/A"}},{"$f":"VLOOKUP('Special Rates 2018-19'!DFENUM,newdatacalc!$A$33:$BV$55,66,0)","v":{"$error":"#N/A"}},{"$f":"VLOOKUP('Special Rates 2018-19'!DFENUM,newdatacalc!$A$33:$BV$55,67,0)","v":{"$error":"#N/A"}},null,null,{"$f":"VLOOKUP('Special Rates 2018-19'!DFENUM,newdatacalc!$A$33:$BV$55,68,0)","v":{"$error":"#N/A"}},{"$f":"VLOOKUP('Special Rates 2018-19'!DFENUM,newdatacalc!$A$33:$BV$55,69,0)","v":{"$error":"#N/A"}},{"$f":"VLOOKUP('Special Rates 2018-19'!DFENUM,newdatacalc!$A$33:$BV$55,70,0)","v":{"$error":"#N/A"}},{"$f":"VLOOKUP('Special Rates 2018-19'!DFENUM,newdatacalc!$A$33:$BV$55,71,0)","v":{"$error":"#N/A"}},{"$f":"VLOOKUP('Special Rates 2018-19'!DFENUM,newdatacalc!$A$33:$BV$55,72,0)","v":{"$error":"#N/A"}}]
["(D)","MFG rate (D-input) X 98.5%",null,null,null,null,null,null,null,{"$f":"J33*0.985","v":0},{"$f":"K33*0.985","v":0},0,0,{"$f":"N33*0.985","v":0},null,null,{"$f":"Q33*0.985","v":{"$error":"#N/A"}},{"$f":"R33*0.985","v":{"$error":"#N/A"}},{"$error":"#N/A"},{"$error":"#N/A"},{"$f":"U33*0.985","v":{"$error":"#N/A"}},null,null,{"$f":"X33*0.985","v":{"$error":"#N/A"}},{"$f":"Y33*0.985","v":{"$error":"#N/A"}},{"$error":"#N/A"},{"$error":"#N/A"},{"$error":"#N/A"}]
[]
[]
[null,null,null,null,null,null,null,null,null,"MLD & SLCN","BESD","SLD","PD & PMLD","ASD",null,null,"MLD & SLCN","BESD","SLD","PD & PMLD","ASD",null,null,"MLD & SLCN","BESD","SLD","PD & PMLD","ASD"]
["(E)","Final Rate (Greater of Formula (C) or MFG (D))",null,null,null,null,"Formula (C)",null,null,{"$f":"J31","v":5324.671224400131},{"$f":"K31","v":6439.9185600325973},{"$f":"L31","v":7580.9113706568642},{"$f":"M31","v":11340.921531625063},{"$f":"N31","v":8720.7339334075386},null,"Formula",{"$f":"Q31","v":{"$error":"#N/A"}},{"$f":"R31","v":{"$error":"#N/A"}},{"$f":"S31","v":{"$error":"#N/A"}},{"$f":"T31","v":{"$error":"#N/A"}},{"$f":"U31","v":{"$error":"#N/A"}},null,"Formula",{"$f":"X31","v":{"$error":"#N/A"}},{"$f":"Y31","v":{"$error":"#N/A"}},{"$f":"Z31","v":{"$error":"#N/A"}},{"$f":"AA31","v":{"$error":"#N/A"}},{"$f":"AB31","v":{"$error":"#N/A"}}]
[null,null,null,null,null,null,"MFG funding rate (D)",null,null,{"$f":"J34","v":0},{"$f":"K34","v":0},0,0,0,null,"MFG",{"$f":"Q34","v":{"$error":"#N/A"}},{"$f":"R34","v":{"$error":"#N/A"}},{"$error":"#N/A"},{"$error":"#N/A"},{"$error":"#N/A"},null,"MFG",{"$f":"X34","v":{"$error":"#N/A"}},{"$f":"Y34","v":{"$error":"#N/A"}},{"$error":"#N/A"},{"$error":"#N/A"},{"$error":"#N/A"}]
[null,null,null,null,null,null,"Amount of MFG if (D) is greater than ( C)",null,null,{"$f":"IF(J38>J39,0,J39-J38)","v":0},{"$f":"IF(K38>K39,0,K39-K38)","v":0},0,0,0,null,"Amount of MFG if (D) is greater than ( C)",{"$f":"IF(Q38>Q39,0,Q39-Q38)","v":{"$error":"#N/A"}},{"$error":"#N/A"},{"$error":"#N/A"},{"$error":"#N/A"},{"$error":"#N/A"},null,"Amount of MFG if (D) is greater than ( C)",{"$f":"IF(X38>X39,0,X39-X38)","v":{"$error":"#N/A"}},{"$f":"IF(Y38>Y39,0,Y39-Y38)","v":{"$error":"#N/A"}},{"$error":"#N/A"},{"$error":"#N/A"},{"$error":"#N/A"}]
{"$rows_left_out":57}
{"sheet":"Nursery Lump Sums","index":1,"n_rows":113,"n_cols":10,"rows_kept":113,"cut":false,"hidden":false,"merged":[]}
[]
[null,"2018/19 Nursery Provision Lump Sum Calculation"]
[]
[]
[null,null,"Rates"]
[]
[null,null,"Leadership Lump Sum per provision",50000,null,null,null,null,"Day Rate Breakdown"]
[null,null,"Day Rate per FTE (see breakdown)",8681.57]
[null,null,null,null,null,null,null,null,"Support Staff",7073.65]
[null,null,"Calculation",null,null,null,null,null,"Other Staffing",1003.07]
[null,null,null,null,null,null,null,null,"Resources",354.08]
[null,null,null,"Units","Rate","Total",null,null,"Training/Sundry",250.77]
[null,null,"Leadership Lump Sum",{"$f":"IFERROR(VLOOKUP(DFENUM,newdatacalc!$A$33:$CL$55,9,0),0)","v":0},50000,{"$f":"IFERROR(E13*D13,\"TBC\")","v":0},null,null,"Total FTE Funding",8681.57]
[null,null,"Day Rate",{"$f":"IFERROR(VLOOKUP(DFENUM,newdatacalc!$A$33:$CL$55,10,0),0)","v":0},8681.57,{"$f":"IFERROR(E14*D14,\"TBC\")","v":0}]
[]
[null,null,null,null,"Total Funding at this provision:",{"$f":"IFERROR(F14+F13,\"TBC\")","v":0}]
[]
[]
[null,null,"This funding will be provided in twelve equal instalments (except where a Nursery provision is commissioned to start in-year)"]
[]
[]
[]
[]
[]
[]
[]
[]
[]
[]
[]
[]
[]
[]
[]
[]
[]
[]
[]
[]
[]
{"$rows_left_out":74}
{"sheet":"newdatacalc","index":2,"n_rows":56,"n_cols":89,"rows_kept":56,"cut":false,"hidden":true,"merged":[]}
[1,2,3,4,5,6,7,8,9,10,11,12,13,14,15,16,17,18,19,20,21,22,23,24,25,26,27,28,29,30,31,32,33,34,35,36,40,37,38,39,41,42,43,44,45,46,47,48,49,50,51,52,53,54,55,56,57,58,59,60,61,62,63,64,65,66,67,68,69,70,71,72,73,74,89,90,91,92,93,94,95,96,97,98,99,100,101,102,103]
[]
[]
["Calc",null,null,21796.724279993101,14697.993577082399,14697.993577082399,10788.0243655825]
["Dfe","School","Type","ASD High rate","ASD Low Rate","BESD High rate","BESD Low Rate",null,"Dfe","Primary Pupils","Secondary Pupils","Total Pupils","% secondary","25% BESD2","Specialist School","Lump sum day","Lump sum day catering","London Fridge Dat rate"]
[7032,"Bower Grove School","B&L",0,1,{"$f":"VLOOKUP(A6,$I$6:$N$10,6,0)","v":0.10377358490566038},{"$f":"1-F6","v":0.89622641509433965},null,7032,44,62,106,{"$f":"J6/L6","v":0.41509433962264153},{"$f":"M6*0.25","v":0.10377358490566038},1,1,1,3854.25]
[7033,"St Anthony's School","B&L",0,1,{"$f":"VLOOKUP(A7,$I$6:$N$10,6,0)","v":8.6206896551724144E-2},{"$f":"1-F7","v":0.9137931034482758},null,7033,20,38,58,{"$f":"J7/L7","v":0.34482758620689657},{"$f":"M7*0.25","v":8.6206896551724144E-2},1,1,1,3854.25]
[7044,"Rowhill School","B&L",0,1,{"$f":"VLOOKUP(A8,$I$6:$N$10,6,0)","v":0.10326086956521739},0.89673913043478259,null,7044,19,27,46,0.41304347826086957,{"$f":"M8*0.25","v":0.10326086956521739},1,1,1,3854.25]
[7045,"Elms School","B&L",0,1,{"$f":"VLOOKUP(A9,$I$6:$N$10,6,0)","v":8.3333333333333329E-2},0.91666666666666663,null,7045,23,46,69,0.33333333333333331,8.3333333333333329E-2,1,1,1,3854.25]
[7062,"The Orchard School","B&L",0,1,{"$f":"VLOOKUP(A10,$I$6:$N$10,6,0)","v":7.6612903225806453E-2},0.92338709677419351,null,7062,19,43,62,0.30645161290322581,7.6612903225806453E-2,1,1,1,3854.25]
[7041,"Goldwyn Community Special School","BESD",0,1,0.75,0.25,null,null,null,null,null,null,null,1,1,1,3854.25]
[7067,"Portal House School","BESD",0,1,0.75,0.25,null,null,null,null,null,null,null,1,1,1,3854.25]
[7002,"Broomhill Bank School","C&I",0.1,0.9,0,1,null,null,null,null,null,null,null,1,1,1,3854.25]
[7052,"Grange Park School","C&I",0.1,0.9,0,1,null,null,null,null,null,null,null,1,1,1,3854.25]
[7058,"Stone Bay School","C&I",1,0,0,1,null,null,null,null,null,null,null,1,1,1,3854.25]
[7073,"Laleham Gap School","C&I",0.1,0.9,0,1,null,null,null,null,null,null,null,1,1,1,3854.25]
[7021,"Valence School","PD",0,1,0,1,null,null,null,null,null,null,null,1,1,1,3854.25]
[7039,"The Ifield School","PSCN",0.1,0.9,0,1,null,null,null,null,null,null,null,1,1,1,3854.25]
[7040,"Foreland Fields School","PSCN",0.1,0.9,0,1,null,null,null,null,null,null,null,1,1,1,3854.25]
[7043,"The Beacon Folkestone","PSCN",0.1,0.9,0,1,null,null,null,null,null,null,null,1,1,1,3854.25]
[7051,"Nexus School","PSCN",0.1,0.9,0,1,null,null,null,null,null,null,null,1,1,1,3854.25]
[7056,"Five Acre Wood School","PSCN",0.1,0.9,0,1,null,null,null,null,null,null,null,1,1,1,3854.25]
[7063,"St Nicholas' School","PSCN",0.1,0.9,0,1,null,null,null,null,null,null,null,1,1,1,3854.25]
[7066,"Milestone School","PSCN",0.1,0.9,0,1,null,null,null,null,null,null,null,1,1,1,3854.25]
[7069,"The Wyvern School","PSCN",0.1,0.9,0,1,null,null,null,null,null,null,null,1,1,1,3854.25]
[7070,"Oakley School","PSCN",0.1,0.9,0,1,null,null,null,null,null,null,null,1,1,1,3854.25]
[7072,"Meadowfield School","PSCN",0.1,0.9,0,1,null,null,null,null,null,null,null,1,1,1,3854.25]
[]
[1,2,3,4,5,6,7,8,9,10,11,12,13,14,15,16,17,18,19,20,21,22,23,24,25,26,27,28,29,30,31,32,33,34,35,36,37,38,39,40,41,42,43,44,45,46,47,48,49,50,51,52,53,54,55,56,57,58,59,60,61,62,63,64,65,66,67,68,69,70,71,72,73,74,75,76,77,78,79,80,81,82,83,84,85,86,87,88,89]
[]
[null,null,null,21796.724279993101,10788.024365582505,null,null,null,null,null,null,null,null,null,null,null,null,null,null,null,null,null,null,null,null,null,null,null,null,null,null,null,null,null,null,null,null,null,null,null,null,null,null,null,null,null,null,null,null,null,null,null,null,null,null,null,null,null,null,null,null,null,null,null,null,null,null,null,null,null,null,null,null,null,null,{"$f":"SUM(BX34:BX55)","v":0},100,16,3552,578,3327,549,92,16]
["Data",null,null,14697.993577082399,14697.993577082434,null,null,null,null,null,null,null,null,{"$f":"SUM(N34:N55)","v":0},{"$f":"SUM(O34:O55)","v":0},null,null,null,null,null,null,null,null,null,null,null,null,null,null,null,null,null,null,null,null,null,null,null,null,null,"DAY April to August 2018 (A) ","DAY April to August 2018 (A) ","DAY April to August 2018 (A) ","DAY April to August 2018 (A) ","DAY April to August 2018 (A) ","WeekD April to August 2018 (A) ","WeekD April to August 2018 (A) ","WeekD April to August 2018 (A) ","WeekD April to August 2018 (A) ","WeekD April to August 2018 (A) ","WeekEnd April to August 2018 (A) ","WeekEnd April to August 2018 (A) ","WeekEnd April to August 2018 (A) ","WeekEnd April to August 2018 (A) ","WeekEnd April to August 2018 (A) ",null,null,"DAY September to March 2018 (D input) ","DAY September to March 2018 (D input) ","DAY September to March 2018 (D input) ","DAY September to March 2018 (D input) ","DAY September to March 2018 (D input) ","WeekD September to March 2018 (D input) ","WeekD September to March 2018 (D input) ","WeekD September to March 2018 (D input) ","WeekD September to March 2018 (D input) ","WeekD September to March 2018 (D input) ","WeekEnd September to March 2018 (D input) ","WeekEnd September to March 2018 (D input) ","WeekEnd September to March 2018 (D input) ","WeekEnd September to March 2018 (D input) ","WeekEnd September to March 2018 (D input) ",null,null,"Place data (18/19)",null,null,null,null,null,"Place data (17/18)"]
["Dfe","School","Type","ASDAdjusted Rate due to School type (see note 1)","BESDAdjusted Rate due to School type (see note 1)","Day provision","Resi -Weekday","Resi -Weekend","Nursery","Nursery FTE",null,null,null,null,null,null,null,null,null,null,"London Fringe Residential Pupils (DAY adjustment for Broomhill)","Lunch Grant","Gross Day Floor Area (m2)","Residential Floor Area Weekday (m2)","Residential Floor Area Weekend (m2)","Grounds Site Area (hectares)","Rentals","Rentals","Lump sum standard","lump sum catering day","lump sum residential","lump sum residential rate","Hydrotherapy Pool","% FSM",null,"London Fringe Day Pupils","London Fringe Residential Pupils","Split site- Band  1","Split site - Band 2","split site 2 rate","MLD & SLCN","BESD","SLD","PD & PMLD","ASD","MLD & SLCN","BESD","SLD","PD & PMLD","ASD","MLD & SLCN","BESD","SLD","PD & PMLD","ASD",null,null,"MLD & SLCN","BESD","SLD","PD & PMLD","ASD","MLD & SLCN","BESD","SLD","PD & PMLD","ASD","MLD & SLCN","BESD","SLD","PD & PMLD","ASD",null,null,null,"Day","Res Weekday","Res Weekend","Pre-16","Post-16","Pre-16","Post-16","Weekday Residential","Weekend Residential",null,"Residential weekday","Residential Weekend","Residential Weekday Places- Catering","Residential Weekend Places Catering"]
[7032,"Bower Grove School","B&L",709.87307029106341,405.75152194810653,1,null,null,0,0,null,null,null,null,null,null,null,null,null,null,{"$f":"AK34","v":0},0,4093,0,0,2.1496,0,0,1,1,0,null,0,0.38725490196078433,null,0,0,1,0,null,11643.598574996147,13974.376423026801,15511.438825721976,21957.170530238884,17465.420361866018,null,null,null,null,null,null,null,null,null,null,null,null,11647.101245936319,13958.684350660638,15514.941496662146,21960.673201179055,17468.923032806189,null,null,null,null,null,null,null,null,null,null,null,null,null,null,0,0,212,0,208,0,0,0]
[7033,"St Anthony's School","B&L",709.87307029106341,337.06631133620067,1,null,null,0,0,null,null,null,null,null,null,null,null,null,null,{"$f":"AK35","v":0},0,3614,0,0,1.54,0,0,1,1,0,null,0,0.50505050505050508,null,0,0,0,0,null,14260.372825499251,16515.205156263928,18128.213076225078,24573.944780741989,20082.194612369123,null,null,null,null,null,null,null,null,null,null,null,null,14267.384914406721,16520.974564898228,18135.22516513255,24580.956869649461,20089.206701276591,null,null,null,null,null,null,null,null,null,null,null,null,null,null,0,0,98,0,96,0,0,0]
[7044,"Rowhill School","B&L",709.87307029106341,403.74682075271085,1,null,null,0,0,null,null,null,null,null,null,null,null,null,null,1,0,4165,0,0,1.8948,0,0,1,1,0,null,0,0.53271028037383172,null,1,1,0,0,null,13949.212639788862,16327.599526331393,17892.211750179547,24463.116550280531,19889.907592271175,null,null,null,null,null,null,null,null,null,null,null,null,14013.845721764599,16365.233452971517,17956.844832155282,24527.749632256266,19954.540674246913,null,null,null,null,null,null,null,null,null,null,null,null,null,null,0,0,110,0,110,0,0,0]
[7045,"Elms School","B&L",709.87307029106341,325.83076762499513,1,null,null,0,0,null,null,null,null,null,null,null,null,null,null,0,0,2771,0,0,2.13,0,0,1,1,0,null,0,0.6,null,0,0,0,0,null,13242.790093067699,15498.085909988315,17110.630343793528,23556.362048310442,19064.611879937576,null,null,null,null,null,null,null,null,null,null,null,null,13446.056710501362,15666.466457334041,17297.21044752912,23742.942152046031,19251.191983673165,null,null,null,null,null,null,null,null,null,null,null,null,null,null,0,0,115,0,115,0,0,0]
[7062,"The Orchard School","B&L",709.87307029106341,299.55409281652646,1,null,null,0,0,null,null,null,null,null,null,null,null,null,null,0,0,2505,0,0,1.81,0,0,1,1,0,null,0,0.44303797468354428,null,0,0,0,0,null,14797.620562659176,16953.846213747875,18665.460813385012,25111.192517901927,20619.442349529061,null,null,null,null,null,null,null,null,null,null,null,null,14813.934185134771,16995.615364944169,18681.774435860607,25127.506140377518,20635.755972004656,null,null,null,null,null,null,null,null,null,null,null,null,null,null,0,0,83,0,80,0,0,0]
[7041,"Goldwyn Community Special School","BESD",null,2932.4769086249453,1,null,null,0,0,null,null,null,null,null,null,null,null,null,null,0,0,5362.3800899999997,0,0,7.3492000000000006,0,0,1,1,0,null,0,0.34108527131782945,null,0,0,1,1,38427,13656.808337422724,18501.137821417615,17524.648588148553,23970.380292665464,19478.630124292598,null,null,null,null,null,null,null,null,null,null,null,null,14538.9299042326,19046.068674084479,18114.268135730024,24072.567930553592,19920.493985427627,null,null,null,null,null,null,null,null,null,null,null,null,null,null,0,0,150,0,130,0,0,0]
[7067,"Portal House School","BESD",null,2932.4769086249453,1,null,null,0,0,null,null,null,null,null,null,null,null,null,null,0,0,3091,0,0,0.81,0,0,1,1,0,null,0,0.33333333333333331,null,0,0,0,0,null,16861.601214525308,21705.930698520202,20729.441465251137,27175.173169768052,22683.423001395186,null,null,null,null,null,null,null,null,null,null,null,null,16843.193973422338,21685.118353168487,20708.629119899422,27154.360824416341,22662.610656043471,null,null,null,null,null,null,null,null,null,null,null,null,null,null,0,0,60,0,60,0,0,0]
{"$rows_left_out":16}