{"text_format":"1","workbook":"xlsx","n_sheets":4,"sheets":["Introduction","Benchmarking","2024-25 Data","PFI Adjustments"],"not_rendered":{"charts":0,"images":2,"macros":1,"external_links":2,"defined_names":7,"comments":0,"pivot_tables":0},"unopened":[],"bounds":{"document_bytes":16777216,"sheet_cells":100000,"rows_first":2000,"rows_last":500,"rows_between":2000,"halvings":0,"cell_chars":16384,"cell_head_chars":4096},"cells_cut":0,"cells_raw":0,"read":"whole","date_system":"1900"}

{"sheet":"Introduction","index":0,"n_rows":22,"n_cols":5,"rows_kept":22,"cut":false,"hidden":false,"merged":[[6,4,9,4],[13,4,15,4],[16,4,17,4]]}
[]
[]
[null,{"$f":"Benchmarking!C1&\" Data\"","v":"2024-25 Data"},null,null,{"$f":"\"Kent LA Schools' Benchmarking Data \"&Benchmarking!C1","v":"Kent LA Schools' Benchmarking Data 2024-25"}]
[]
[null,null,null,null,"THIS BENCHMARKING SHEET IS FOR PRIMARY SCHOOLS ONLY"]
[]
[null,null,null,null,{"$f":"\"The Benchmarking spreadsheet shows the income and expenditure information for the \"&Benchmarking!C1&\" financial year at subjective account level i.e. CFR codes. It shows all revenue income and expenditure including standards funds. Capital income and expenditure is excluded.\"","v":"The Benchmarking spreadsheet shows the income and expenditure information for the 2024-25 financial year at subjective account level i.e. CFR codes. It shows all revenue income and expenditure including standards funds. Capital income and expenditure is excluded."}]
[]
[]
[]
[]
[null,null,null,null,"Enter your DFE number in the pink shaded box.  "]
[]
[null,null,null,null,"Select Schools with or without Nursery places, School type and Pupil options from the drop down boxes.  "]
[]
{"$rows_left_out":8}
{"sheet":"Benchmarking","index":1,"n_rows":81,"n_cols":15,"rows_kept":81,"cut":false,"hidden":false,"merged":[[8,13,8,14],[7,8,7,10],[9,12,10,14],[9,4,9,5],[10,4,10,5],[10,8,10,10],[4,8,4,10],[9,8,9,10],[5,1,6,5],[2,8,2,10],[6,8,6,10],[3,8,3,10],[5,8,5,10]]}
[null,"Subjective Analysis of ","2024-25"," Income and Expenditure Compared to selected and Kent Primary Averages"]
[]
[null,null,null,null,null,"Nursery","R to Yr 6",null,"Benchmark against schools with Nursery's"]
[null,null,"Enter last 4 digits of your DfE No.",null,"Pupil Roll",{"$f":"IF(ISERROR(VLOOKUP(D4,'2024-25 Data'!A3:C254,3,0)),\"\",VLOOKUP(D4,'2024-25 Data'!A3:C254,3,0))","v":""},{"$f":"IF(ISERROR(VLOOKUP(D4,'2024-25 Data'!A3:D254,4,0)),\"\",VLOOKUP(D4,'2024-25 Data'!A3:D254,4,0))","v":""}]
[null,null,null,null,null,null,null,null,"Select type of School"]
[null,{"$f":"B1&C1&D1","v":"Subjective Analysis of 2024-25 Income and Expenditure Compared to selected and Kent Primary Averages"}]
[null,null,null,null,null,null,null,null,"Select Pupil Roll to Benchmark against"]
[]
[null,null,null,null,null,null,null,null,null,null,null,null,null,{"$f":"IF(I6=\"\",\"\",IF(I4=I6,\"you have already selected this school\",\"\"))","v":""}]
[null,null,null,null,"Your School",null,null,null,"Your selection includes:",null,null,null,"All Kent Primary Schools"]
[null,null,null,null,{"$f":"IF(D4=\"\",\"\",\"Total Pupil Roll : \"&VLOOKUP($D$4,'2024-25 Data'!A3:I254,9,FALSE))","v":""},null,null,null,{"$f":"SUM('2024-25 Data'!M3:M254)&\" Schools\"","v":"0 Schools"}]
[null,{"$f":"IF(D4=\"\",\"\",VLOOKUP($D$4,'2024-25 Data'!A3:B254,2,0))","v":""},null,"total\nExp. / Inc.","amount\nper Pupil","% of total \nExp.","% of Exp / total inc.",null,{"$f":"E12","v":"amount\nper Pupil"},{"$f":"F12","v":"% of total \nExp."},{"$f":"G12","v":"% of Exp / total inc."},null,{"$f":"E12","v":"amount\nper Pupil"},{"$f":"F12","v":"% of total \nExp."},{"$f":"G12","v":"% of Exp / total inc."}]
[null,"(Total Revenue)",null,"£","£","%","%",null,"£","%","%",null,"£","%","%"]
[]
[null,"EXPENDITURE"]
{"$rows_left_out":67}
{"sheet":"2024-25 Data","index":2,"n_rows":263,"n_cols":82,"rows_kept":263,"cut":false,"hidden":true,"merged":[[0,75,0,77],[0,79,0,80],[0,4,0,5]]}
[null,"PFI School",{"$f":"\"Autumn \"&LEFT(Benchmarking!C1,4)-1&\" Roll\"","v":"Autumn 2023 Roll"},{"$f":"Benchmarking!C1&\" School Budget Templates\"","v":"2024-25 School Budget Templates"},"KCC Finance & Procurement",null,"Self generating",null,null,null,null,null,null,{"$f":"\"From \"&Benchmarking!C1&\" Checking Spreadsheet\"","v":"From 2024-25 Checking Spreadsheet"},null,null,null,null,null,null,null,null,null,null,null,null,null,null,null,null,null,null,null,null,null,null,null,null,null,null,null,null,null,null,null,null,null,null,null,null,null,null,"Self generating","KCC Finance & Procurement\nAll Negative figures","Self generating\n(HNOU, HNTU & HN3U)","Self generating\n(HNMT & HN3M)",{"$f":"N1","v":"From 2024-25 Checking Spreadsheet"},null,null,null,null,null,null,null,null,null,null,null,null,null,null,null,null,null,null,{"$f":"\"From March 20\"&RIGHT(Benchmarking!C1,2)&\" Advances\"","v":"From March 2025 Advances"},null,null,"Self generating",{"$f":"\"From March 20\"&RIGHT(Benchmarking!C1,2)&\" Advances\"","v":"From March 2025 Advances"},null,"Self generating"]
["DFE","SCHOOL","NURSERY NUMS","YR R-6 INC SRP","SRP FTE","HNP FTE","NURSERY","PHASE","SIZE CLASS","NURSERY SELECTA","PHASE SELECTA","SIZE SELECTA","OVERALL SLECTA","E01","E02","E03","E04","E05","E06","E07","E08","E09","E10","E11","E12","E13","E14","E15","E16","E17","E18","E19","E20A","E20B","E20C","E20D","E20E","E20F","E20G","E21","E22","E23","E24","E25","E26","E27","E28","E28B","E29","E30","E31","E32","Funds delegated by the LEA (excluding High Needs)","Notional SEN Budget","Specially Rescourced Provision (Unit) Funding","Funding for High Needs Pupils","I04","I05","I06","I07","I08","I08b","I09","I10","I11","I12","I13","I15","I16","I17","I18","I18A","I18B","I18C","I01 + I03","HNOU","HNTU","HN3U","AV Total","HNMT","HN3M","AW Total"]
[2000,"St Johns CE Primary School, Canterbury",27,404,0,23.8,{"$f":"IF(C3=0,\"No\",\"Yes\")","v":"Yes"},"Primary",{"$f":"IFERROR(VLOOKUP($D3,$D$256:$F$261,3,TRUE),0)","v":"400-499"},{"$f":"IF(G3=Benchmarking!$I$4,1,0)","v":0},{"$f":"IF(Benchmarking!$I$6=\"All\",1,IF(Benchmarking!$I$6=H3,1,0))","v":0},{"$f":"SUBTOTAL(9,C3:K3)","v":454.8},{"$f":"IF(SUM(J3:L3)=3,1,0)","v":0},1647662.42,0,632071.97,75664.5,137979.28,0,66416.66,10279.790000000001,18720.61,812.04,11824.56,26283.16,26738.61,38335.480000000003,8114.06,54944.17,39839.64,19295.32,104496.45,2958.19,960,10713.960000000001,23464.86,570,1814.93,4949.09,0,4741.18,15972.24,4862.92,124481.16,26344.920000000002,92651.06,15113.960000000001,0,0,1005.25,0,0,{"$f":"BW3-BB3-BC3-BD3","v":-2046198.030793777},-472765.04920622299,{"$f":"-CA3","v":0},{"$f":"-CD3","v":-141156.61000000002},-4500,-302410,-6856.93,-76173.87,-50817.5,-8184.12,-10289.370000000001,0,-31597.100000000002,-5795.2300000000005,-5274.52,0,0,0,-51198,0,0,-17910.420000000002,-2660119.69,0,0,0,{"$f":"SUM(BX3:BZ3)","v":0},141156.61000000002,0,{"$f":"SUM(CB3:CC3)","v":141156.61000000002}]
[2002,"Repton Manor Primary School",0,446,0,22.4,"No","Primary","400-499",{"$f":"IF(G4=Benchmarking!$I$4,1,0)","v":0},{"$f":"IF(Benchmarking!$I$6=\"All\",1,IF(Benchmarking!$I$6=H4,1,0))","v":0},{"$f":"IF(Benchmarking!$I$8=\"All\",1,IF(Benchmarking!$I$8=I4,1,0))","v":0},0,1230107.44,0,486081.91000000003,47116.94,149486.78,0,208902.6,1077.6500000000001,6830.49,896.46,12911.76,23255.81,4844.2,62729.770000000004,8462.1200000000008,78085.17,10650,23249.09,143655.33000000002,4292.32,0,12563.53,21537.7,0,2933.62,19384.63,0,18577.080000000002,17064,20775,148713.42000000001,48449.25,9769.25,14934.15,0,0,45803.96,0,0,-1877967.2624644162,-295409.38753558398,0,-177384.66000000003,0,-138050,-5056.93,-115600.86,-18470,-88561.27,-44792.28,0,-13149.16,-13486.68,-12844.68,0,0,0,-81167,0,0,-8025,-2350761.31,0,0,0,0,177384.66000000003,0,177384.66000000003]
[2065,"Discovery School, The",0,626,0,15.9,"No","Primary","500+",{"$f":"IF(G5=Benchmarking!$I$4,1,0)","v":0},{"$f":"IF(Benchmarking!$I$6=\"All\",1,IF(Benchmarking!$I$6=H5,1,0))","v":0},{"$f":"IF(Benchmarking!$I$8=\"All\",1,IF(Benchmarking!$I$8=I5,1,0))","v":0},0,1846766.1400000001,0,754812.61,73129.53,159295.94,0,238033.51,17738.670000000002,7445,1258.26,18362.88,36706.82,13660.300000000001,29188.49,6785.83,47004.66,94458,19931.96,88719.96,4495,0,8873.6,14552.89,751.5,13908.19,28342.350000000002,0,23057.72,25086.98,19102.34,194727.92,27641.83,15235.99,36606.6,0,0,0,0,0,-2718048.1633460713,-414196.14665392815,0,-160835.45000000001,0,-90200,-4713.8599999999997,-2430,-25869.65,-130318.52,-92015.52,0,-28918.58,-42257.67,-7104.85,0,0,0,-134697,0,0,-4431.8,-3293079.76,0,0,0,0,160835.45000000001,0,160835.45000000001]
[2079,"Woodlands Primary School ",0,592,0,14.8,"No","Primary","500+",{"$f":"IF(G6=Benchmarking!$I$4,1,0)","v":0},{"$f":"IF(Benchmarking!$I$6=\"All\",1,IF(Benchmarking!$I$6=H6,1,0))","v":0},{"$f":"IF(Benchmarking!$I$8=\"All\",1,IF(Benchmarking!$I$8=I6,1,0))","v":0},0,1849732.1,31190.420000000002,619718.34,53619.92,132708.96,0,2512.64,14888.48,9802.01,3673.92,17138.400000000001,47170.48,14863.89,98747.83,15534.62,66298.12,69342,31227.31,177239.99,7028.5,0,561.84,20059.75,5513.6,3935.64,13095.69,0,27473.31,22649.88,42935.47,114949.46,18494.89,12668,23386.510000000002,0,0,13522.050000000001,0,0,-2515330.3392032064,-422167.52079679363,0,-131650.74000000002,0,-223870.68,-8170.79,0,-33601.06,-17657.88,0,0,0,-92970.69,-35336.97,0,0,0,-91177,0,0,-11281.25,-3069148.6,0,0,0,0,131650.74000000002,0,131650.74000000002]
[2088,"Crockenhill Primary School",0,192,0,1.8,"No","Primary","100-199",{"$f":"IF(G7=Benchmarking!$I$4,1,0)","v":0},{"$f":"IF(Benchmarking!$I$6=\"All\",1,IF(Benchmarking!$I$6=H7,1,0))","v":0},{"$f":"IF(Benchmarking!$I$8=\"All\",1,IF(Benchmarking!$I$8=I7,1,0))","v":0},0,741936.39,0,119125.96,33090.53,69882.759999999995,0,49628.090000000004,4359.4400000000005,4263.3,6020.91,5558.4000000000005,5121.12,2131.9900000000002,8968.2199999999993,7344.8,19497.77,34398,12989.9,39790.870000000003,5245,0,9571.0500000000011,11917.6,0,103.49000000000001,10945.75,0,3113.32,7488.91,5631.9400000000005,53667.91,4265,22417.62,21995.53,0,0,0,0,0,-952323.95283285296,-160049.38716714716,0,-8527.4999999999964,0,-92749.8,-600,0,-2378.7200000000003,-55890.8,0,0,-10032.780000000001,-12727.45,-8362.01,0,0,0,-44758,0,0,-1398.96,-1120900.8400000001,0,0,0,0,8527.4999999999964,0,8527.4999999999964]
[2089,"Anthony Roper Primary School, The",0,272,0,4.416666666666667,"No","Primary","200-299",{"$f":"IF(G8=Benchmarking!$I$4,1,0)","v":0},{"$f":"IF(Benchmarking!$I$6=\"All\",1,IF(Benchmarking!$I$6=H8,1,0))","v":0},{"$f":"IF(Benchmarking!$I$8=\"All\",1,IF(Benchmarking!$I$8=I8,1,0))","v":0},0,841332.13,12457.11,222625.46,14098.32,74853.78,0,83905.19,946.5,6170,8433.9699999999993,7874.4000000000005,6725.91,10885,26930.799999999999,3140.5,40938.43,7043.4000000000005,32411.66,59668.31,3746.39,0,2009.93,18024.510000000002,10020.86,0,7020,0,10195.200000000001,10609.33,13745.470000000001,46013.93,12884.050000000001,17816,28988.89,0,0,13130.28,0,0,-1190210.1025586866,-149416.75744131321,0,-44592.450000000004,0,-50630,-4000,0,-23011.74,-2945.32,0,0,-9085.91,-29221.600000000002,-34361.15,0,0,0,-54639,0,0,-715.42,-1384219.3099999998,0,0,0,0,44592.450000000004,0,44592.450000000004]
[2094,"Cobham Primary School",0,215,0,9,"No","Primary","200-299",{"$f":"IF(G9=Benchmarking!$I$4,1,0)","v":0},{"$f":"IF(Benchmarking!$I$6=\"All\",1,IF(Benchmarking!$I$6=H9,1,0))","v":0},{"$f":"IF(Benchmarking!$I$8=\"All\",1,IF(Benchmarking!$I$8=I9,1,0))","v":0},0,638162.27,0,290941.63,23944.670000000002,44962.73,0,15256.29,4562.6099999999997,5201.26,1962.93,6224.28,5658.82,4937.96,3508.76,350,24524.71,17216,8333.58,50069.07,4681.28,0,3592.01,8830.57,0,71.739999999999995,2055,0,4080.9,8225.94,7032.33,35694.51,0,26010.95,20155.53,0,0,0,0,0,-962596.49763892707,-103767.51236107296,0,-44328.040000000008,0,-35750,-200,-1888,-3202.5,-13173.14,0,-720,-13926.5,-21616.61,-15158.92,0,0,0,-56273,0,0,-1658.33,-1110692.05,0,0,0,0,44328.040000000008,0,44328.040000000008]
[2095,"Cecil Road Primary School",49,371,0,20.166666666666668,"Yes","Primary","300-399",{"$f":"IF(G10=Benchmarking!$I$4,1,0)","v":0},{"$f":"IF(Benchmarking!$I$6=\"All\",1,IF(Benchmarking!$I$6=H10,1,0))","v":0},{"$f":"IF(Benchmarking!$I$8=\"All\",1,IF(Benchmarking!$I$8=I10,1,0))","v":0},0,1336690.26,0,692276.19000000006,45537.78,99268.800000000003,0,26808.9,1099.8500000000001,7915.8600000000006,14885.95,10984.2,15481.220000000001,996.04000000000008,43245.950000000004,11619.630000000001,44716.91,34048,12933.56,51990.44,3186.32,0,6311.4000000000005,18706.87,0,2451.41,7124.5,0,22556.3,15169.62,12422.98,74411.37,8667.5,14636.04,23423.8,0,0,0,0,0,-1916513.40240653,-260550.23759347011,0,-149596.10999999999,0,-90940,-5771.29,-13418.58,-42106.25,-35198.03,0,-10138,-24405.53,-19322.72,-5387.7300000000005,0,0,0,-69877,0,0,-5316.67,-2326659.75,0,0,0,0,149596.10999999999,0,149596.10999999999]
[2109,"Higham Primary School",0,210,0,9.6666666666666661,"No","Primary","200-299",{"$f":"IF(G11=Benchmarking!$I$4,1,0)","v":0},{"$f":"IF(Benchmarking!$I$6=\"All\",1,IF(Benchmarking!$I$6=H11,1,0))","v":0},{"$f":"IF(Benchmarking!$I$8=\"All\",1,IF(Benchmarking!$I$8=I11,1,0))","v":0},0,691820.05,3196.9900000000002,241820.55000000002,64688.83,90109.77,43408.03,47632.5,5114.6900000000005,7452.5,7078.14,6795.96,4499.51,9448.5500000000011,2893.9500000000003,2491.2200000000003,25897.4,24950,5711.7,45754.590000000004,2487,0,1946.02,9282.0300000000007,8400,563.73,378.72,0,3655.86,8034.6,2345.02,24637.03,10454.200000000001,1035,10995.06,0,0,0,0,0,-938997.77256122616,-142743.08743877386,0,-100472.69000000002,0,-46190,-400,-4490,-4860.3900000000003,-44851.15,-31457.45,-5616,-8826.4,-19952.689999999999,-18024.03,0,0,0,-56619,0,0,-1255.6300000000001,-1182213.55,0,0,0,0,100472.69000000002,0,100472.69000000002]
[2116,"Lawn Primary School",27,207,0,6.416666666666667,"Yes","Primary","200-299",{"$f":"IF(G12=Benchmarking!$I$4,1,0)","v":0},{"$f":"IF(Benchmarking!$I$6=\"All\",1,IF(Benchmarking!$I$6=H12,1,0))","v":0},{"$f":"IF(Benchmarking!$I$8=\"All\",1,IF(Benchmarking!$I$8=I12,1,0))","v":0},0,754071.5,0,407406.78,73418.430000000008,81478.84,61949.73,69899,811.72,9282.9500000000007,416.07,6080.04,10850.28,8828.86,1703.93,7335.04,27921.66,20459,8817.34,88776.84,3001.5,0,9373.51,12608.43,0,9066.42,7738.59,0,4545.21,8269.380000000001,1256.31,32570.940000000002,0,7820,25678.77,0,0,0,0,0,-1197407.8970530005,-255919.77294699918,0,-56961.840000000004,0,-153320,-1056.93,-24824.880000000001,0,-21954.46,-12359.12,0,-4838.53,-13963.01,-4862.9000000000005,0,0,0,-40499,0,0,-2626.88,-1510289.5099999998,0,0,0,0,56961.840000000004,0,56961.840000000004]
[2120,"Bean Primary School",0,194,0,1.8333333333333333,"No","Infant","100-199",{"$f":"IF(G13=Benchmarking!$I$4,1,0)","v":0},{"$f":"IF(Benchmarking!$I$6=\"All\",1,IF(Benchmarking!$I$6=H13,1,0))","v":0},{"$f":"IF(Benchmarking!$I$8=\"All\",1,IF(Benchmarking!$I$8=I13,1,0))","v":0},0,654908.20000000007,0,178032.56,37818.35,64039.200000000004,0,28140.79,3631.46,3409.67,404.56,5701.32,9224.7000000000007,6697.93,21409.510000000002,1780.04,22728.55,16717,8061.21,65577.41,11287.380000000001,0,2036.8700000000001,9329.32,7887.8600000000006,1639.08,7920.75,0,14107.33,8204.94,3384.83,59679.56,0,10904,21093.53,0,0,0.5,0,0,-980008.14104958344,-155946.00895041664,0,-18850.730000000003,0,-71040,-882.53,-1870,-5785,-18638.400000000001,0,0,-13308.44,-15717.81,0,0,0,0,-49196,0,0,-3368.75,-1154804.8800000001,0,0,0,0,18850.730000000003,0,18850.730000000003]
[2128,"Capel Primary School",0,207,0,3.25,"No","Primary","200-299",{"$f":"IF(G14=Benchmarking!$I$4,1,0)","v":0},{"$f":"IF(Benchmarking!$I$6=\"All\",1,IF(Benchmarking!$I$6=H14,1,0))","v":0},{"$f":"IF(Benchmarking!$I$8=\"All\",1,IF(Benchmarking!$I$8=I14,1,0))","v":0},0,622520.62,0,246614.07,42951.29,83360.45,41178.370000000003,66876.66,7869.52,5800.17,416.07,5992.68,2378.36,5348.9400000000005,2174.88,4308.7300000000005,26194.62,23827.25,10030.300000000001,55747.26,3954,0,4976.8100000000004,6380.18,0,2990.69,8610.94,0,5652.59,7919.8200000000006,5825.99,27905.61,2276.73,18108.03,12725.41,0,0,0,0,0,-942248.59001881047,-119034.74998118944,0,-24354.489999999994,0,-60290,-3256.9300000000003,0,-500,-63033.310000000005,-17043.98,0,-3580.63,-15858.1,-10696.4,0,0,0,-50767.67,0,0,-2054.1799999999998,-1085637.8299999998,0,0,0,0,24354.489999999994,0,24354.489999999994]
[2130,"Dunton Green Primary School",0,160,0,8.3333333333333339,"No","Primary","100-199",{"$f":"IF(G15=Benchmarking!$I$4,1,0)","v":0},{"$f":"IF(Benchmarking!$I$6=\"All\",1,IF(Benchmarking!$I$6=H15,1,0))","v":0},{"$f":"IF(Benchmarking!$I$8=\"All\",1,IF(Benchmarking!$I$8=I15,1,0))","v":0},0,524738.44000000006,0,270859.98,47419.9,60472.950000000004,0,0,3377.66,2492,333.66,4632,54121.700000000004,7792,10704.99,1371.3600000000001,25783.850000000002,24576,3193.41,64731.840000000004,0,0,0,1227.3600000000001,7407.16,0,1322.16,0,34488.699999999997,6240.72,0,45973.35,0,1530.3600000000001,89267.72,0,0,0,0,0,-824515.21518495714,-109610.66481504292,0,-50348.619999999995,0,-78780,-5882.53,-6180.97,-8809.2000000000007,-28356.53,0,-2000,-35272.67,-26225.760000000002,-16068.73,0,0,0,-38948,0,0,-5200,-984474.5,0,0,0,0,50348.619999999995,0,50348.619999999995]
{"$rows_left_out":249}
{"sheet":"PFI Adjustments","index":3,"n_rows":8,"n_cols":17,"rows_kept":8,"cut":false,"hidden":true,"merged":[[4,0,4,1],[3,10,3,15]]}
["PFI Breakdown",null,null,"E12","E13","E15","E23","E24","E28"]
[2689,"The Craylands School",{"$f":"\"Closedown figures from 20\"&RIGHT(Benchmarking!C1,5)&CHAR(10)&\" Checking Spreadsheet\"","v":"Closedown figures from 2024-25\n Checking Spreadsheet"},2650.68,0,2090.7800000000002,15560.38,4137.07,25122.91]
[]
[null,null,null,null,null,null,null,null,null,null,"Standard percentage figures for 2014-15 to 2017-18\nChanges to 2023-24  in line with new CFR Pack"]
["PFI Breakdown",null,{"$f":"\"E28B total from \n20\"&RIGHT(Benchmarking!C1,5)&CHAR(10)&\" Checking Spreadsheet\"","v":"E28B total from \n2024-25\n Checking Spreadsheet"},"E12","E13","E15","E23","E24","E28",null,"E12","E13","E15","E23","E24","E28","Comments"]
[2689,"The Craylands School",323745.83,{"$f":"$C6*K6","v":36201.614517442358},5426.7297587203893,2590.6702815323915,29055.069623061838,205507.09052928921,44964.655289953829,null,0.11182109903142955,1.6762315544636943E-2,8.002173438133215E-3,8.9746544760319652E-2,0.63477911214883975,0.13888875507664092,"Calculation"]
[]
[2689,"The Craylands School","Adjusted PFI Figures",{"$f":"D2+D6","v":38852.294517442358},5426.7297587203893,4681.4502815323922,44615.449623061839,209644.16052928922,70087.565289953825]