{"text_format":"1","workbook":"xlsx","n_sheets":4,"sheets":["Introduction","Benchmarking","2022-23 Data","PFI Adjustments"],"not_rendered":{"charts":0,"images":2,"macros":1,"external_links":2,"defined_names":6,"comments":0,"pivot_tables":0},"unopened":[],"bounds":{"document_bytes":16777216,"sheet_cells":100000,"rows_first":2000,"rows_last":500,"rows_between":2000,"halvings":0,"cell_chars":16384,"cell_head_chars":4096},"cells_cut":0,"cells_raw":0,"read":"whole","date_system":"1900"}

{"sheet":"Introduction","index":0,"n_rows":22,"n_cols":5,"rows_kept":22,"cut":false,"hidden":false,"merged":[[6,4,9,4],[13,4,15,4],[16,4,17,4]]}
[]
[]
[null,{"$f":"Benchmarking!C1&\" Data\"","v":"2022-23 Data"},null,null,{"$f":"\"Kent LA Schools' Benchmarking Data \"&Benchmarking!C1","v":"Kent LA Schools' Benchmarking Data 2022-23"}]
[]
[null,null,null,null,"THIS BENCHMARKING SHEET IS FOR PRIMARY SCHOOLS ONLY"]
[]
[null,null,null,null,{"$f":"\"The Benchmarking spreadsheet shows the income and expenditure information for the \"&Benchmarking!C1&\" financial year at subjective account level i.e. CFR codes. It shows all revenue income and expenditure including standards funds. Capital income and expenditure is excluded.\"","v":"The Benchmarking spreadsheet shows the income and expenditure information for the 2022-23 financial year at subjective account level i.e. CFR codes. It shows all revenue income and expenditure including standards funds. Capital income and expenditure is excluded."}]
[]
[]
[]
[]
[null,null,null,null,"Enter your DFE number in the pink shaded box.  "]
[]
[null,null,null,null,"Select Schools with or without Nursery places, School type and Pupil options from the drop down boxes.  "]
[]
{"$rows_left_out":8}
{"sheet":"Benchmarking","index":1,"n_rows":75,"n_cols":15,"rows_kept":75,"cut":false,"hidden":false,"merged":[[4,8,4,10],[9,8,9,10],[5,1,6,5],[2,8,2,10],[6,8,6,10],[3,8,3,10],[5,8,5,10],[8,13,8,14],[7,8,7,10],[9,12,10,14],[9,4,9,5],[10,4,10,5],[10,8,10,10]]}
[null,"Subjective Analysis of ","2022-23"," Income and Expenditure Compared to selected and Kent Primary Averages"]
[]
[null,null,null,null,null,"Nursery","R to Yr 6",null,"Benchmark against schools with Nursery's"]
[null,null,"Enter last 4 digits of your DfE No.",null,"Pupil Roll",{"$f":"IF(ISERROR(VLOOKUP(D4,'2022-23 Data'!A3:C262,3,0)),\"\",VLOOKUP(D4,'2022-23 Data'!A3:C262,3,0))","v":""},{"$f":"IF(ISERROR(VLOOKUP(D4,'2022-23 Data'!A3:D262,4,0)),\"\",VLOOKUP(D4,'2022-23 Data'!A3:D262,4,0))","v":""}]
[null,null,null,null,null,null,null,null,"Select type of School"]
[null,{"$f":"B1&C1&D1","v":"Subjective Analysis of 2022-23 Income and Expenditure Compared to selected and Kent Primary Averages"}]
[null,null,null,null,null,null,null,null,"Select Pupil Roll to Benchmark against"]
[]
[null,null,null,null,null,null,null,null,null,null,null,null,null,{"$f":"IF(I6=\"\",\"\",IF(I4=I6,\"you have already selected this school\",\"\"))","v":""}]
[null,null,null,null,"Your School",null,null,null,"Your selection includes:",null,null,null,"All Kent Primary Schools"]
[null,null,null,null,{"$f":"IF(D4=\"\",\"\",\"Total Pupil Roll : \"&VLOOKUP($D$4,'2022-23 Data'!A3:I262,9,FALSE))","v":""},null,null,null,{"$f":"SUM('2022-23 Data'!M3:M262)&\" Schools\"","v":"0 Schools"}]
[null,{"$f":"IF(D4=\"\",\"\",VLOOKUP($D$4,'2022-23 Data'!A3:B262,2,0))","v":""},null,"total\nExp. / Inc.","amount\nper Pupil","% of total \nExp.","% of Exp / total inc.",null,{"$f":"E12","v":"amount\nper Pupil"},{"$f":"F12","v":"% of total \nExp."},{"$f":"G12","v":"% of Exp / total inc."},null,{"$f":"E12","v":"amount\nper Pupil"},{"$f":"F12","v":"% of total \nExp."},{"$f":"G12","v":"% of Exp / total inc."}]
[null,"(Total Revenue)",null,"£","£","%","%",null,"£","%","%",null,"£","%","%"]
[]
[null,"EXPENDITURE"]
{"$rows_left_out":61}
{"sheet":"2022-23 Data","index":2,"n_rows":271,"n_cols":76,"rows_kept":271,"cut":false,"hidden":true,"merged":[[0,69,0,71],[0,73,0,74],[0,4,0,5]]}
[null,"PFI School",{"$f":"\"Autumn \"&LEFT(Benchmarking!C1,4)&\" Roll\"","v":"Autumn 2022 Roll"},{"$f":"Benchmarking!C1&\" School Budget Templates\"","v":"2022-23 School Budget Templates"},"KCC Finance & Procurement",null,"Self generating",null,null,null,null,null,null,{"$f":"\"From \"&Benchmarking!C1&\" Checking Spreadsheet\"","v":"From 2022-23 Checking Spreadsheet"},null,null,null,null,null,null,null,null,null,null,null,null,null,null,null,null,null,null,null,null,null,null,null,null,null,null,null,null,null,null,null,null,"Self generating","KCC Finance & Procurement\nAll Negative figures","Self generating\n(HNOU, HNTU & HN3U)","Self generating\n(HNMT & HN3M)",{"$f":"N1","v":"From 2022-23 Checking Spreadsheet"},null,null,null,null,null,null,null,null,null,null,null,null,null,null,null,null,null,null,{"$f":"\"From March 20\"&RIGHT(Benchmarking!C1,2)&\" Advances\"","v":"From March 2023 Advances"},null,null,"Self generating",{"$f":"\"From March 20\"&RIGHT(Benchmarking!C1,2)&\" Advances\"","v":"From March 2023 Advances"},null,"Self generating"]
["DFE","SCHOOL","NURSERY NUMS","YR R-6 INC SRP","SRP FTE","HNP FTE","NURSERY","PHASE","SIZE CLASS","NURSERY SELECTA","PHASE SELECTA","SIZE SELECTA","OVERALL SLECTA","E01","E02","E03","E04","E05","E06","E07","E08","E09","E10","E11","E12","E13","E14","E15","E16","E17","E18","E19","E20","E21","E22","E23","E24","E25","E26","E27","E28","E28B","E29","E30","E31","E32","Funds delegated by the LEA (excluding High Needs)","Notional SEN Budget","Specially Rescourced Provision (Unit) Funding","Funding for High Needs Pupils","I04","I05","I06","I07","I08","I08b","I09","I10","I11","I12","I13","I15","I16","I17","I18","I18A","I18B","I18C","I01 + I03","HNOU","HNTU","HN3U","AV Total","HNMT","HN3M","AW Total"]
[2000,"St Johns CE Primary School, Canterbury",28,374,0,13.833333333333334,{"$f":"IF(C3=0,\"No\",\"Yes\")","v":"Yes"},"Primary",{"$f":"IFERROR(VLOOKUP($D3,$D$264:$F$269,3,TRUE),0)","v":"300-399"},{"$f":"IF(G3=Benchmarking!$I$4,1,0)","v":0},{"$f":"IF(Benchmarking!$I$6=\"All\",1,IF(Benchmarking!$I$6=H3,1,0))","v":0},{"$f":"SUBTOTAL(9,C3:K3)","v":415.83333333333331},{"$f":"IF(SUM(J3:L3)=3,1,0)","v":0},1240016.45,0,458262.23,71169.89,109136.45,0,130245.42,16033.07,11192.29,733.04,8751.9600000000009,15454.08,4501.63,32274.95,8005.24,67606.06,24576,15591.35,79592.430000000008,10971.35,0,24772.850000000002,13708.42,3766.6800000000003,112789.96,137908.31,58893.200000000004,31655.420000000002,0,0,0,0,0,{"$f":"BQ3-AV3-AW3-AX3","v":-1612882.99},-392995.98,{"$f":"-BU3","v":0},{"$f":"-BX3","v":-100739.57000000002},0,-296610,-514.27,-72897.73,-30362.75,-17794.34,-3057.92,0,-14129.43,-13404.6,-4582.26,0,0,0,-53183,0,-17917.34,-37752.68,-2106618.54,0,0,0,{"$f":"SUM(BR3:BT3)","v":0},0,100739.57000000002,{"$f":"SUM(BV3:BW3)","v":100739.57000000002}]
[2002,"Repton Manor Primary School",0,477,0,16.25,"No","Primary","400-499",{"$f":"IF(G4=Benchmarking!$I$4,1,0)","v":0},{"$f":"IF(Benchmarking!$I$6=\"All\",1,IF(Benchmarking!$I$6=H4,1,0))","v":0},{"$f":"IF(Benchmarking!$I$8=\"All\",1,IF(Benchmarking!$I$8=I4,1,0))","v":0},0,1272078.8900000001,1778.23,460513.93,29218.09,111859.12,0,180674.15,1457.05,7509.6500000000005,934.92000000000007,11009.16,40797.840000000004,21041.71,47386.87,4601.34,56347.770000000004,10650,16257.130000000001,121481.16,31258.53,0,27402.63,16871.490000000002,19644.900000000001,126585.25,89911.400000000009,34860.54,14325.300000000001,0,0,120000,0,0,-1751660.42,-353467.19,0,-97309.459999999992,0,-147220,0,-99546.7,-15984.73,-95217.05,-50594.32,0,0,-25301.47,-11181.36,0,0,0,-77262,0,0,-31918.260000000002,-2202437.0699999998,0,0,0,0,0,97309.459999999992,97309.459999999992]
[2065,"Discovery School, The",0,624,0,15.416666666666666,"No","Primary","500+",{"$f":"IF(G5=Benchmarking!$I$4,1,0)","v":0},{"$f":"IF(Benchmarking!$I$6=\"All\",1,IF(Benchmarking!$I$6=H5,1,0))","v":0},{"$f":"IF(Benchmarking!$I$8=\"All\",1,IF(Benchmarking!$I$8=I5,1,0))","v":0},0,1620714.13,0,682550.31,87786.47,143215.42000000001,0,203732.33000000002,15430.03,15150.7,1223.04,14401.960000000001,39470.29,7534.49,3479.41,8702.4600000000009,39317.75,75264,20730.62,121420.53,43281.82,0,51021.71,22149.54,22656.54,159172.01999999999,32819.340000000004,13922.98,49580.380000000005,0,0,15000,0,0,-2265292.67,-538477.32999999996,0,-155590.75999999998,0,-60266,-1200,-44918.28,-27064.45,-89594.76,-72928.63,0,-8209.14,-46779.93,-18592.75,0,0,0,-120109,0,-23113.45,-14148.970000000001,-2959360.76,0,0,0,0,0,155590.75999999998,155590.75999999998]
[2066,"Maypole Primary School",0,407,0,6,"No","Primary","400-499",{"$f":"IF(G6=Benchmarking!$I$4,1,0)","v":0},{"$f":"IF(Benchmarking!$I$6=\"All\",1,IF(Benchmarking!$I$6=H6,1,0))","v":0},{"$f":"IF(Benchmarking!$I$8=\"All\",1,IF(Benchmarking!$I$8=I6,1,0))","v":0},0,1005013.76,0,362030.04,51145.22,79426.7,0,82336.160000000003,6301.1900000000005,18106.21,827.47,9563.52,38707.33,34133.89,5237.1400000000003,4942.58,64712.49,38144,15271.39,152336.42000000001,12935.65,0,26422.22,15369.61,5950.64,70173.38,135937.22,36278.14,49094.720000000001,0,0,257447.99000000002,0,0,-1608696.5,-243507.46,0,-48848.179999999993,0,-90635,0,-23383.33,-886.5,-68812.36,0,0,-13111.800000000001,-47060.26,-6524.58,0,0,0,-69445,0,0,-23585.57,-1901052.14,0,0,0,0,0,48848.179999999993,48848.179999999993]
[2079,"Woodlands Primary School ",0,639,0,8.9166666666666661,"No","Primary","500+",{"$f":"IF(G7=Benchmarking!$I$4,1,0)","v":0},{"$f":"IF(Benchmarking!$I$6=\"All\",1,IF(Benchmarking!$I$6=H7,1,0))","v":0},{"$f":"IF(Benchmarking!$I$8=\"All\",1,IF(Benchmarking!$I$8=I7,1,0))","v":0},0,1633180.21,27161.91,605585.03,60413.49,111456.52,0,1697.8,15707.27,17667.060000000001,4033.44,14748.12,158533.49,64342.400000000001,46985.840000000004,19170.939999999999,64910.41,57856,26292.720000000001,218793.66,31256.510000000002,0,34643.07,22601.43,11294.2,95914.59,8051,11303.87,39632.44,0,0,10912,0,0,-2356807.2500000005,-515064.61,0,-92580.359999999986,0,-176398.57,0,0,-31244.9,-17842.07,0,0,0,-74629.38,-4191.62,0,0,0,-102765,0,0,-38058.480000000003,-2964452.22,0,0,0,0,0,92580.359999999986,92580.359999999986]
[2088,"Crockenhill Primary School",0,203,0,4.416666666666667,"No","Primary","200-299",{"$f":"IF(G8=Benchmarking!$I$4,1,0)","v":0},{"$f":"IF(Benchmarking!$I$6=\"All\",1,IF(Benchmarking!$I$6=H8,1,0))","v":0},{"$f":"IF(Benchmarking!$I$8=\"All\",1,IF(Benchmarking!$I$8=I8,1,0))","v":0},0,577816.47,7753.26,120423.74,35016.480000000003,61815.85,0,40179.29,4056.36,5247.5,3391.7200000000003,4685.28,4993.8,3455.21,4227.57,5277.93,29103.7,24116.670000000002,3969.32,56937,5889.76,0,15794.390000000001,7326.82,3751.98,40476.720000000001,83032.160000000003,36215.300000000003,26821.05,0,0,0,0,0,-874069.54999999993,-102067.64,0,-30013.66,0,-81870,-1200,0,-1764,-35856.230000000003,0,0,-12342.75,-16033.83,-8246.2900000000009,0,0,0,-40389,0,0,-14492,-1006150.85,0,0,0,0,0,30013.66,30013.66]
[2089,"Anthony Roper Primary School, The",0,299,0,2.75,"No","Primary","200-299",{"$f":"IF(G9=Benchmarking!$I$4,1,0)","v":0},{"$f":"IF(Benchmarking!$I$6=\"All\",1,IF(Benchmarking!$I$6=H9,1,0))","v":0},{"$f":"IF(Benchmarking!$I$8=\"All\",1,IF(Benchmarking!$I$8=I9,1,0))","v":0},0,802516.38,34126.17,256641.1,0,59158.15,0,64014.239999999998,218,7533.59,7726.45,6900.96,11464.73,6300,24835.190000000002,1628.03,35563.69,6656,22838.28,94529.81,24369.06,0,16878.66,10791.7,10872.09,55425.03,10437,0,35952.07,0,0,8103,0,0,-1186508.0599999998,-151215.32,0,-12968.82,0,-52935,-1200,-25738.760000000002,-16460.13,-621.5,0,-5220,-2442.73,-48367.5,-35734.42,0,0,0,-65956,0,0,-10847.95,-1350692.2,0,0,0,0,0,12968.82,12968.82]
[2094,"Cobham Primary School",0,219,0,4.833333333333333,"No","Primary","200-299",{"$f":"IF(G10=Benchmarking!$I$4,1,0)","v":0},{"$f":"IF(Benchmarking!$I$6=\"All\",1,IF(Benchmarking!$I$6=H10,1,0))","v":0},{"$f":"IF(Benchmarking!$I$8=\"All\",1,IF(Benchmarking!$I$8=I10,1,0))","v":0},0,553330.57999999996,0,266533.63,18823.05,37577.919999999998,0,13530.42,4210.0200000000004,5460,1723.28,5054.5200000000004,6613.02,7131.75,4374.51,1245.46,23589.850000000002,17216,7768.77,66471.38,7933.01,0,7916.95,7746.03,7456.43,31665.08,0,27984.940000000002,19471.05,0,0,23392,0,0,-869952.45000000007,-114259.59,0,-23860.21,0,-28670,-1200,-23718.05,0,-20147.330000000002,0,0,-16378.53,-26420.49,-11597.66,0,0,0,-47388,0,0,-5079,-1008072.25,0,0,0,0,0,23860.21,23860.21]
[2095,"Cecil Road Primary School",54,375,0,17.083333333333332,"Yes","Primary","300-399",{"$f":"IF(G11=Benchmarking!$I$4,1,0)","v":0},{"$f":"IF(Benchmarking!$I$6=\"All\",1,IF(Benchmarking!$I$6=H11,1,0))","v":0},{"$f":"IF(Benchmarking!$I$8=\"All\",1,IF(Benchmarking!$I$8=I11,1,0))","v":0},0,1090391.1599999999,0,671009.6,41074.879999999997,78402.55,0,16160.53,487.68,9198.48,12164.78,8859,19399.189999999999,514.23,46977.8,6892.45,46647.93,34048.400000000001,9981.99,72158.91,13980.28,0,35995.919999999998,14079.75,5328.3,58846.79,17628.59,21592.19,27322.81,0,0,19780.150000000001,0,0,-1719504.0999999999,-258131.09,0,-117336.12000000001,0,-103831,-1200,-4285.03,-31970,-9316.84,0,-6974.5,-6247.76,-11875.16,-2298.0500000000002,0,0,0,-63709,0,0,-20206.330000000002,-2094971.31,0,0,0,0,0,117336.12000000001,117336.12000000001]
[2109,"Higham Primary School",0,208,0,7.75,"No","Primary","200-299",{"$f":"IF(G12=Benchmarking!$I$4,1,0)","v":0},{"$f":"IF(Benchmarking!$I$6=\"All\",1,IF(Benchmarking!$I$6=H12,1,0))","v":0},{"$f":"IF(Benchmarking!$I$8=\"All\",1,IF(Benchmarking!$I$8=I12,1,0))","v":0},0,551206.24,6454.35,195268.05000000002,54745.58,78816.38,36680.85,40440.090000000004,5082.13,5504,6986.21,4800.6000000000004,7562.07,3942.23,2596.9700000000003,3371.98,29327.510000000002,22330,4480.8,61637.22,46870.450000000004,0,11270.300000000001,7356.92,2123.33,23035.39,34345,1740,14055.28,0,0,0,0,0,-859494.24,-98693.95,0,-62547.070000000007,0,-46155,-32776,-720,-2562.25,-35366.01,-19314.43,-1652,-295.87,-18506.53,-23328.48,0,0,0,-54852,0,0,-5098.41,-1020735.26,0,0,0,0,0,62547.070000000007,62547.070000000007]
[2116,"Lawn Primary School",21,188,0,3.8333333333333335,"Yes","Primary","100-199",{"$f":"IF(G13=Benchmarking!$I$4,1,0)","v":0},{"$f":"IF(Benchmarking!$I$6=\"All\",1,IF(Benchmarking!$I$6=H13,1,0))","v":0},{"$f":"IF(Benchmarking!$I$8=\"All\",1,IF(Benchmarking!$I$8=I13,1,0))","v":0},0,629070.64,5716.81,391345.87,61014.700000000004,81787.23,55357.46,64205.22,2645.34,14280.4,368.48,4419,6017.03,3501.26,930.35,2.57,29530,20708.5,8468.64,79510.25,7299.52,0,17636.990000000002,6969.52,1541.83,22437.33,0,14875.04,49559.57,0,0,3449.16,0,0,-928348.62,-231116.73,0,-27007.430000000004,0,-156320,-1200,-44875,0,-17976.350000000002,-13165.6,0,-3525.65,-8317.6,0,0,0,0,-32216,0,0,-23992.25,-1186472.78,0,0,0,0,0,27007.430000000004,27007.430000000004]
[2119,"Shears Green Infant School",0,334,0,0,"No","Primary","300-399",{"$f":"IF(G14=Benchmarking!$I$4,1,0)","v":0},{"$f":"IF(Benchmarking!$I$6=\"All\",1,IF(Benchmarking!$I$6=H14,1,0))","v":0},{"$f":"IF(Benchmarking!$I$8=\"All\",1,IF(Benchmarking!$I$8=I14,1,0))","v":0},0,196698.13,0,65273.060000000005,14949.79,22718.73,0,10351.74,233.55,6331.62,654.64,1927.17,13933.09,3109.81,0,0,6833.87,0,5612.09,32173.100000000002,1724.92,0,5748.74,7805.57,232550,13260.17,20728.740000000002,2338.21,6335,0,0,0,0,0,-158218.72999999998,-215078.75,0,-15519.330000000002,0,-18157.5,0,0,0,-5307.9800000000005,0,0,-1109.8600000000001,-4744.41,0,0,0,0,-22819,0,0,-5540.63,-388816.81,0,0,0,0,0,15519.330000000002,15519.330000000002]
[2120,"Bean Primary School",0,192,0,4.5,"No","Infant","100-199",{"$f":"IF(G15=Benchmarking!$I$4,1,0)","v":0},{"$f":"IF(Benchmarking!$I$6=\"All\",1,IF(Benchmarking!$I$6=H15,1,0))","v":0},{"$f":"IF(Benchmarking!$I$8=\"All\",1,IF(Benchmarking!$I$8=I15,1,0))","v":0},0,551421.75,0,185426.64,32448.41,55554.17,0,27084.99,3272.32,7253.97,390.36,4431.3599999999997,15423.04,3708.88,17457.13,2586.4299999999998,24385.62,16092,8336.51,83033.790000000008,13214.89,0,20451.810000000001,6929.76,1216.57,35417.160000000003,1483.2,14831.69,15819.59,0,0,52753.18,0,0,-816986.95000000007,-102134.85,0,-53550.000000000007,0,-56785,0,-9700,-945,-20543.59,0,0,0,-17730.43,0,0,0,0,-38954,0,0,-12450.380000000001,-972671.8,0,0,0,0,0,53550.000000000007,53550.000000000007]
{"$rows_left_out":257}
{"sheet":"PFI Adjustments","index":3,"n_rows":8,"n_cols":23,"rows_kept":8,"cut":false,"hidden":true,"merged":[[4,0,4,1]]}
["PFI Breakdown",null,null,"E12","E13","E14","E15","E16","E23","E24","E25","E28"]
[2689,"The Craylands School",{"$f":"\"Closedown figures from 20\"&RIGHT(Benchmarking!C1,5)&CHAR(10)&\" Checking Spreadsheet\"","v":"Closedown figures from 2022-23\n Checking Spreadsheet"},7199.99,241.88,17565.650000000001,1.6400000000000001,13115.54,13383.09,4337.05,8793.34,18733.939999999999]
[]
[null,null,null,null,null,null,null,null,null,null,null,null,null,"Standard percentage figures for 2014-15 to 2017-18"]
["PFI Breakdown",null,{"$f":"\"E28B total from \n20\"&RIGHT(Benchmarking!C1,5)&CHAR(10)&\" Checking Spreadsheet\"","v":"E28B total from \n2022-23\n Checking Spreadsheet"},"E12","E13","E14","E15","E16","E23","E24","E25","E28",null,"E12","E13","E14","E15","E16","E23","E24","E25","E28","Comments"]
[2689,"The Craylands School",253541.03,{"$f":"$C6*N6","v":18217.614477048428},2730.8746290268687,35985.198745979753,1303.6941322979983,0,14621.283167956824,103416.62927101362,54638.326106552457,22627.409470124039,null,7.1852727256998317E-2,1.0770937662542701E-2,0.14193047470849099,5.1419453975476799E-3,0,5.7668311783527992E-2,0.4078891265489204,0.21550092348584549,8.9245553156126409E-2,"Calculation"]
[]
[2689,"The Craylands School","Adjusted PFI Figures",{"$f":"D2+D6","v":25417.60447704843},2972.7546290268688,53550.848745979754,1305.3341322979984,13115.54,28004.373167956823,107753.67927101362,63431.666106552453,41361.349470124042]