{"text_format":"1","workbook":"xlsx","n_sheets":3,"sheets":["Special Rates 2024-25","DATA","Firing Range"],"not_rendered":{"charts":0,"images":1,"macros":1,"external_links":0,"defined_names":57,"comments":0,"pivot_tables":0},"unopened":[],"bounds":{"document_bytes":16777216,"sheet_cells":100000,"rows_first":2000,"rows_last":500,"rows_between":2000,"halvings":0,"cell_chars":16384,"cell_head_chars":4096},"cells_cut":0,"cells_raw":0,"read":"whole","date_system":"1900"}

{"sheet":"Special Rates 2024-25","index":0,"n_rows":141,"n_cols":19,"rows_kept":141,"cut":false,"hidden":false,"merged":[]}
[]
[]
[]
[null,null,null,null,"2024/25 Calculation of Special School Funding Rates"]
[]
[]
[]
[null,"DfE",null,null,{"$f":"IFERROR(VLOOKUP(DFENUM,DATA!B5:C28,2,0),\"\")","v":""}]
[]
[]
[null,"Section 1 - Commissioned Place numbers"]
[]
[null,"Academic Year","Pre-16","Post-16","Weekday Residential","Weekend Residential",null,"High Needs Place numbers as agreed annually with the Local Authority's SEN team\n\n"]
[]
[null,"2023/24",{"$f":"IFERROR(VLOOKUP(DFENUM,DATA!B5:K28,3,0),0)","v":0},{"$f":"IFERROR(VLOOKUP(DFENUM,DATA!B5:K28,5,0),0)","v":0},{"$f":"IFERROR(VLOOKUP(DFENUM,DATA!B5:K28,7,0),0)","v":0},{"$f":"IFERROR(VLOOKUP(DFENUM,DATA!B5:K28,9,0),0)","v":0},null,"Place numbers 2023-24 agreed November 2022"]
[]
[null,"2024/25",{"$f":"IFERROR(VLOOKUP(DFENUM,DATA!B5:K28,4,0),0)","v":0},{"$f":"IFERROR(VLOOKUP(DFENUM,DATA!B5:K28,6,0),0)","v":0},{"$f":"IFERROR(VLOOKUP(DFENUM,DATA!B5:K28,8,0),0)","v":0},{"$f":"IFERROR(VLOOKUP(DFENUM,DATA!B5:K28,10,0),0)","v":0},null,"Place numbers 2024-25 agreed November 2023"]
[]
[null,"Movement",{"$f":"C17-C15","v":0},{"$f":"D17-D15","v":0},{"$f":"E17-E15","v":0},{"$f":"F17-F15","v":0}]
[]
{"$rows_left_out":122}
{"sheet":"DATA","index":1,"n_rows":28,"n_cols":85,"rows_kept":28,"cut":false,"hidden":true,"merged":[[2,29,2,36],[2,14,2,16],[2,17,2,19],[2,20,2,22],[1,11,1,25],[2,23,2,25],[2,11,2,13],[1,3,1,10],[2,3,2,4],[2,5,2,6],[2,7,2,8],[2,9,2,10],[2,58,2,59],[2,60,2,61],[1,47,1,55],[2,47,2,49],[2,50,2,52],[2,53,2,55],[2,56,2,57],[1,63,1,73],[2,63,2,67],[2,69,2,73],[1,74,1,84],[2,74,2,78],[2,80,2,84]]}
[null,1,2,3,4,5,6,7,8,9,10,11,12,13,14,15,16,17,18,19,20,21,22,23,24,25,26,27,28,29,30,31,32,33,34,35,36,37,38,39,40,41,42,43,44,45,46,47,48,49,50,51,52,53,54,55,56,57,58,59,60,61,62,63,64,65,66,67,68,69,70,71,72,73,74,75,76,77,78,79,80,81,82,83,84]
[null,null,null,"Places",null,null,null,null,null,null,null,"Rates",null,null,null,null,null,null,null,null,null,null,null,null,null,null,null,null,null,null,null,null,null,null,null,null,null,null,null,null,null,null,null,null,null,null,null,"Residential Rates",null,null,null,null,null,null,null,null,null,null,null,null,null,null,null,"2023/24 Financial Year",null,null,null,null,null,null,null,null,null,null,"2024/25 Financial Year"]
[null,null,null,"Pre-16",null,"Post-16",null,"Weekday",null,"Weekend",null,"MLD & SLCN",null,null,"ASD",null,null,"SEMH",null,null,"SLD",null,null,"PD & PMLD",null,null,null,null,null,"London Fringe",null,null,null,null,null,null,null,null,null,null,null,null,null,null,null,null,null,"ASD Weekday",null,null,"PD Weekday",null,null,"PD Weekend",null,null,"Residential Winter Rates",null,"Residential Pupil Fringe",null,"Residential School Fringe",null,null,"Pupil Led",null,null,null,null,"School","MFG",null,null,null,null,"Pupil Led",null,null,null,null,"School","MFG"]
[null,"DFE","School","23/24","24/25","23/24","24/25","23/24","24/25","23/24","24/25","Summer","Winter","Old Financial Year","Summer","Winter","Old Financial Year","Summer","Winter","Old Financial Year","Summer","Winter","Old Financial Year","Summer","Winter","Old Financial Year",null,"ASD Rate","SEMH Rate","MLD & SLCN","SEMH","SLD","PD & PMLD","ASD","Residential weekdayASD","Residential weekdayPD & PMLD","Residential WeekendPD & PMLD","Gross Day Floor Area","Residential floor area weekday","Residential floor area weekend","Grounds site area","Rentals","Hydrotherapy Pool","No of FSM","London Fringe","Split  site- Band  1","Split site - Band 2","Summer","Last Financial Year","Winter","Summer","Last Financial Year","Winter","Summer","Last Financial Year","Winter","Weekday","Weekend","Weekday","Weekend","Weekday","Weekend","Nursery FTE","MLD&SLCN","SEMH","SLD","PD&PMLD","ASD","All","MLD&SLCN","SEMH","SLD","PD&PMLD","ASD","MLD&SLCN","SEMH","SLD","PD&PMLD","ASD","All","MLD&SLCN","SEMH","SLD","PD&PMLD","ASD"]
[null,7002,"Broomhill Bank School",269,280,107,113,23,23,0,0,12931.648067040353,12942.121578589042,14965.72,20466.770846399973,20477.244357948664,21162.080000000002,19622.820190217528,19633.293701766219,19460.599999999999,17392.615717434295,17403.089228982983,18625.91,24826.763039838886,24837.236551387577,24729.9,null,17665.98072897764,16852.071557332518,46.335616055981617,62.463500586595551,72.608126890523081,116.36360062428801,92.504985123918559,0,0,0,12163,632.10699851023674,0,10.685,0,0,0.33333333333333326,1,0,1,60990.604462056494,61572.78,60445.660204154716,0,0,0,0,0,0,27770.888472523024,0,1008.4175748957728,0,11.244562740780458,0,0,10305.987272543527,16865.959942325069,14679.484969008176,21967.864696855817,17693.362546425509,2540.7950943943956,2118.9425330620779,53.844963280535012,1405.6322365974302,221.23850874978962,927.92365918009455,10512.107017994396,17203.279141171573,14973.074668388337,22407.221990792932,18047.229797354019,2425.6505974493575,2102.7909845562426,0,1320.3142841623012,20.676911757705966,795.01000519662193]
[null,7005,"Aspire School",172,174,0,0,0,0,0,0,13693.51399125197,13672.923867041078,13463.8,21182.467401543654,21161.877277332762,20805.919999999998,20368.558229898532,20347.96810568764,20007.97,18128.209130811367,18107.619006600478,17811.55,25518.600979482198,25498.010855271306,25057.03,null,17665.98072897764,16852.071557332518,0,0,0,0,0,0,0,0,3227,0,0,1.7432000000000001,0,0,0.38666666666666666,0,0,0,0,0,0,0,0,0,0,0,0,0,0,0,0,0,0,0,10260.560197978841,16804.721216259779,14608.300530880209,21853.782735459452,17602.67138453931,3203.2445123614962,0,0,0,0,0,10465.771401938415,17140.81564058498,14900.466541497815,22290.858390168643,17954.724812230099,3215.7316835238676,0,0,0,0,0]
[null,7006,"Snowfields Academy",238,276,10,48,0,0,0,0,13556.933391616119,12875.512721036803,13927.61,21045.886801907804,20364.466131328489,21269.72,20231.977630262681,19550.556959683367,20471.77,17991.62853117552,17310.207860596201,18275.349999999999,25382.020379846348,24700.599709267033,25520.84,null,17665.98072897764,16852.071557332518,0,0,0,0,0,0,0,0,7642,0,0,7.3,0,0,0.33796296296296297,0,0,1,0,0,0,0,0,0,0,0,0,0,0,0,0,0,0,0,10260.560197978841,16804.721216259779,14608.300530880209,21853.782735459452,17602.67138453931,3667.0535555684278,0,0,0,0,0,10465.771401938415,17140.81564058498,14900.466541497815,22290.858390168643,17954.724812230099,2693.6665985064374,837.81004955514618,739.64661090858135,772.5936099957471,663.91921132491552,727.6771892634606]
[null,7021,"Valence School",80,85,30,30,46,46,18,18,17566.715705951563,17302.584085082737,17235.91,24378.054676436288,24113.923055567466,23913.690000000002,24294.65940585854,24030.527784989717,23831.93,22087.584681048258,21823.453060179432,21668.129999999997,29621.494483565835,29357.362862697013,29054.32,null,16852.071557332518,16852.071557332518,177.19703369944551,230.09649495985994,263.37086923674161,406.88882308348917,313.49176553760776,0,0,0,8799,0,1924,18.321999999999999,0,1,0.32926829268292684,1,0,0,0,0,0,82772.646825872449,81163.289999999994,81655.494378516698,111492.86740042048,109320.37,109838.72998239889,42651.041324346566,26849.248533291109,1304.1416107799998,1847.0050961295103,38.42707093153669,38.42707093153669,0,10434.28278003712,17030.306015240032,14866.507265426037,22252.693346325617,17112.066084433904,6801.6276043972666,0,0,0,0,0,10642.96843563786,17370.912135544837,15163.837410734555,22697.747213252136,17454.307406122585,6769.6704914735565,0,0,0,0,0]
[null,7032,"Bower Grove School",225,225,0,0,0,0,0,0,13257.321291453918,13287.924289921171,12988.56,19932.36553010048,19962.968528567733,19532.72,19932.36553010048,19962.968528567733,19532.72,17692.016431013319,17722.619429480568,17336.3,25082.408279684147,25113.0112781514,24581.78,null,16852.071557332518,16852.071557332518,0,0,0,0,0,0,0,0,4185.3,0,0,2.1496,0,0,0.65833333333333333,0,1,0,0,0,0,0,0,0,0,0,0,0,0,0,0,0,0,0,10260.560197978841,16804.721216259779,14608.300530880209,21853.782735459452,16804.721216259779,2727.9999467448561,0,0,0,0,0,10465.771401938415,17140.81564058498,14900.466541497815,22290.858390168643,17140.81564058498,2809.4016386214003,0,0,0,0,0]
[null,7033,"St Anthony's School",106,98,0,0,0,0,0,0,15898.458996979763,16313.240034230963,15632.560000000001,22573.503235626325,22988.284272877521,22055.98,22573.503235626325,22988.284272877521,22055.98,20333.15413653916,20747.93517379036,19900.080000000002,27723.545985209996,28138.327022461188,27098.77,null,16852.071557332518,16852.071557332518,0,0,0,0,0,0,0,0,3614,0,0,1.54,0,0,0.72815533980582525,0,0,0,0,0,0,0,0,0,0,0,0,0,0,0,0,0,0,0,10260.560197978841,16804.721216259779,14608.300530880209,21853.782735459452,16804.721216259779,5244.985940130603,127.01058878853655,6.2751335454195214,46.797646761999204,0,6.2751335454195214,10465.771401938415,17140.81564058498,14900.466541497815,22290.858390168643,17140.81564058498,5674.6432001045487,0,0,0,0,0]
[null,7039,"The Ifield School",227,221,39,45,0,0,0,0,13109.064342333317,13142.414034771664,12877.16,20598.017752625001,20631.367445063348,20219.27,19784.108580979879,19817.458273418226,19421.32,17543.759481892717,17577.109174331061,17224.900000000001,24934.151330563545,24967.501023001892,24470.379999999997,null,17665.98072897764,16852.071557332518,0,0,0,0,0,0,0,0,4274.1399960000008,0,0,6.22,75000,1,0.46445497630331756,0,1,0,0,0,0,0,0,0,0,0,0,0,0,0,0,0,0,6,10260.560197978841,16804.721216259779,14608.300530880209,21853.782735459452,17602.67138453931,2616.5970971363854,0,0,0,0,0,10465.771401938415,17140.81564058498,14900.466541497815,22290.858390168643,17954.724812230099,2662.7469276506049,0,0,0,0,0]
[null,7040,"Foreland Fields School",213,210,30,34,0,0,0,0,13368.390135399808,13398.824986861966,13116.84,20857.343545691492,20887.778397153648,20458.96,20043.43437404637,20073.869225508526,19661.010000000002,17803.085274959205,17833.520126421365,17464.580000000002,25193.477123630037,25223.911975092193,24710.07,null,17665.98072897764,16852.071557332518,0,0,0,0,0,0,0,0,4705.83,0,0,4.4852999999999996,63000,1,0.48826291079812206,0,2,0,0,0,0,0,0,0,0,0,0,0,0,0,0,0,0,10,10260.560197978841,16804.721216259779,14608.300530880209,21853.782735459452,17602.67138453931,2856.284290129759,0,0,0,0,0,10465.771401938415,17140.81564058498,14900.466541497815,22290.858390168643,17954.724812230099,2920.3723968143186,0,0,0,0,0]
[null,7041,"Goldwyn School",160,160,35,35,0,0,0,0,14411.359886819821,15096.218554809104,14529.21,21086.404125466383,21771.262793455666,20670.830000000002,21086.404125466383,21771.262793455666,20670.830000000002,18846.055026379221,19530.913694368501,18474.41,26236.446875050049,26921.305543039329,25719.89,null,16852.071557332518,16852.071557332518,0,0,0,0,0,0,0,0,5856.3800899999997,0,0,7.3492000000000006,47900,0,0.49068322981366458,0,2,4,0,0,0,0,0,0,0,0,0,0,0,0,0,0,0,0,10260.560197978841,16804.721216259779,14608.300530880209,21853.782735459452,16804.721216259779,3866.1107651352704,402.53993688589253,0,0,0,0,10465.771401938415,17140.81564058498,14900.466541497815,22290.858390168643,17140.81564058498,4345.0893745418207,0,0,0,0,0]
[null,7043,"The Beacon Folkestone",278,324,130,84,0,0,0,0,12592.266186869752,12732.964853369784,12356.34,20081.219597161435,20221.918263661468,19698.45,19267.310425516313,19408.009092016346,18900.5,17026.961326429151,17167.659992929181,16704.080000000002,24417.353175099979,24558.051841600012,23949.56,null,17665.98072897764,16852.071557332518,0,0,0,0,0,0,0,0,10148,0,0,5.4561000000000002,0,1,0.54938271604938271,0,0,1,0,0,0,0,0,0,0,0,0,0,0,0,0,0,0,10,10260.560197978841,16804.721216259779,14608.300530880209,21853.782735459452,17602.67138453931,2095.7760100345736,0,0,0,0,0,10465.771401938415,17140.81564058498,14900.466541497815,22290.858390168643,17954.724812230099,2208.5690070563551,0,0,0,0,0]
[null,7044,"Rowhill School",132,150,0,0,0,0,0,0,15186.490542409665,14679.949405158757,14972.18,21997.82951289439,21491.288375643486,21564.93,21923.045710474125,21416.504573223221,21491.61,19707.35951750636,19200.818380255452,19319.370000000003,27241.269320023937,26734.728182773033,26705.55,null,16852.071557332518,16852.071557332518,177.19703369944608,238.70796311734409,263.37086923674212,406.88882308348963,313.49176553760844,0,0,0,4165,0,0,1.8948,0,0,0.59756097560975607,1,0,0,0,0,0,0,0,0,0,0,0,0,0,0,0,0,0,0,10434.28278003712,17038.748631080707,14866.507265426037,22252.693346325617,17112.066084433904,4452.8599568374148,85.040263125465572,0,0,0,0,10642.96843563786,17379.523603702321,15163.837410734555,22697.747213252136,17454.307406122585,4248.0397767087761,156.03268765336179,0,4.0896625566711009,0,0]
[null,7045,"Elms School",152,152,0,0,0,0,0,0,14210.21179722188,14221.05608310384,13877.16,20885.256035868442,20896.100321750404,20421.32,20885.256035868442,20896.100321750404,20421.32,18644.906936781281,18655.751222663239,18224.900000000001,26035.298785452109,26046.143071334071,25470.379999999997,null,16852.071557332518,16852.071557332518,0,0,0,0,0,0,0,0,2771,0,0,2.13,0,0,0.8294573643410853,0,0,0,0,0,0,0,0,0,0,0,0,0,0,0,0,0,0,0,10260.560197978841,16804.721216259779,14608.300530880209,21853.782735459452,16804.721216259779,3616.5958083905016,0,0,0,0,0,10465.771401938415,17140.81564058498,14900.466541497815,22290.858390168643,17140.81564058498,3750.7662287146095,0,0,0,0,0]
[null,7051,"Nexus School",256,256,39,39,0,0,0,0,13053.785595456766,13070.394735513741,13156.27,20542.739005748452,20559.348145805427,20227.129999999997,19728.82983410333,19745.438974160304,19443.900000000001,17488.480735016165,17505.089875073139,17288,24878.872583686996,24895.481723743971,24455.66,null,17665.98072897764,16852.071557332518,0,0,0,0,0,0,0,0,7075.8,0,0,2.36,0,1,0.42325581395348844,0,0,1,0,0,0,0,0,0,0,0,0,0,0,0,0,0,0,8,10260.560197978841,16804.721216259779,14608.300530880209,21853.782735459452,17602.67138453931,2601.8779720593402,293.83422996181798,37.298419833165099,77.820933049744781,0,22.576765436304413,10465.771401938415,17140.81564058498,14900.466541497815,22290.858390168643,17954.724812230099,2597.7028585515873,158.57708950999768,0,0,0,0]
[null,7052,"Grange Park School",95,136,60,75,0,0,0,0,13934.97716730741,13051.112145675348,13575.95,21423.930577599094,20540.065555967034,20918.059999999998,20610.021405953972,19726.156384321912,20120.11,18369.672306866811,17485.807285234747,17923.689999999999,25760.064155537639,24876.199133905575,25169.18,null,17665.98072897764,16852.071557332518,0,0,0,0,0,0,0,0,2589.33,0,0,1.2464999999999999,0,0,0.36842105263157893,0,1,0,0,0,0,0,0,0,0,0,0,0,0,0,0,0,0,0,10260.560197978841,16804.721216259779,14608.300530880209,21853.782735459452,17602.67138453931,3315.3934982156838,0,0,0,0,0,10465.771401938415,17140.81564058498,14900.466541497815,22290.858390168643,17954.724812230099,2953.6178360836266,224.4405119779567,126.27707333139551,159.22407241855399,50.549673747726047,114.30765168626385]
[null,7056,"Five Acre Wood School",648,728,77,110,0,0,0,0,11795.64211668108,11679.165137680287,11645.24,19284.595526972764,19168.118547971972,18987.349999999999,18470.686355327642,18354.209376326849,18189.400000000001,16230.337256240478,16113.860277239686,15992.98,23620.729104911308,23504.252125910516,23238.46,null,17665.98072897764,16852.071557332518,0,0,0,0,0,0,0,0,11119.17,0,0,2.6381999999999999,9259,1,0.38666666666666666,0,1,1,0,0,0,0,0,0,0,0,0,0,0,0,0,0,0,15,10260.560197978841,16804.721216259779,14608.300530880209,21853.782735459452,17602.67138453931,1384.6758931853617,0,0,0,0,0,10465.771401938415,17140.81564058498,14900.466541497815,22290.858390168643,17954.724812230099,1261.9258103255365,0,0,0,0,0]
[null,7058,"Stone Bay School",92,95,11,8,10,10,0,0,15607.493499046635,15626.430501533541,17032.5,30421.629454144408,30440.566456631313,30448.74,22282.537737693197,22301.474740180103,22338.07,20042.188638606032,20061.125641092938,21016.379999999997,27432.580487276864,27451.51748976377,27656.14,null,24991.163273783728,16852.071557332518,0,0,0,0,0,0,0,0,2396.216342490492,1481.783657509508,0,0.96,0,1,0.59793814432989689,0,0,0,93825.461202765087,92041.87,93165.726358897271,90836.412235897544,89111.43,90176.677392029727,0,0,0,33933.592317735958,0,0,0,0,0,0,10260.560197978841,16804.721216259779,14608.300530880209,21853.782735459452,24784.222899055087,5097.0326255162527,1674.9094765049067,436.32035502772487,1311.0443436035421,705.32323902429198,567.48087542866415,10465.771401938415,17140.81564058498,14900.466541497815,22290.858390168643,25279.907357036187,5152.7686818922484,1499.1224161693335,156.17602752277162,1068.2266766099347,350.79362793909968,168.3076610715616]
{"$rows_left_out":9}
{"sheet":"Firing Range","index":2,"n_rows":54,"n_cols":50,"rows_kept":54,"cut":false,"hidden":true,"merged":[]}
[{"$f":"COUNTIF(B1:AT1,\">0\")-22","v":22},null,7032,{"$f":"COUNTIF(D2:D108,\">0\")","v":20},7033,{"$f":"COUNTIF(F2:F108,\">0\")","v":20},7044,{"$f":"COUNTIF(H2:H108,\">0\")","v":18},7045,{"$f":"COUNTIF(J2:J108,\">0\")","v":20},7062,{"$f":"COUNTIF(L2:L108,\">0\")","v":16},7041,{"$f":"COUNTIF(N2:N108,\">0\")","v":20},7067,{"$f":"COUNTIF(P2:P108,\">0\")","v":20},7021,{"$f":"COUNTIF(R2:R108,\">0\")","v":28},7002,{"$f":"COUNTIF(T2:T108,\">0\")","v":19},7052,{"$f":"COUNTIF(V2:V108,\">0\")","v":15},7058,{"$f":"COUNTIF(X2:X108,\">0\")","v":23},7073,{"$f":"COUNTIF(Z2:Z108,\">0\")","v":20},7039,{"$f":"COUNTIF(AB2:AB108,\">0\")","v":21},7040,{"$f":"COUNTIF(AD2:AD108,\">0\")","v":21},7043,{"$f":"COUNTIF(AF2:AF108,\">0\")","v":21},7051,{"$f":"COUNTIF(AH2:AH108,\">0\")","v":20},7056,{"$f":"COUNTIF(AJ2:AJ108,\">0\")","v":21},7063,{"$f":"COUNTIF(AL2:AL108,\">0\")","v":21},7066,{"$f":"COUNTIF(AN2:AN108,\">0\")","v":21},7069,{"$f":"COUNTIF(AP2:AP108,\">0\")","v":21},7070,{"$f":"COUNTIF(AR2:AR108,\">0\")","v":21},7072,{"$f":"COUNTIF(AT2:AT108,\">0\")","v":21},7005,{"$f":"COUNTIF(AV2:AV108,\">0\")","v":20},7006,{"$f":"COUNTIF(AX2:AX108,\">0\")","v":15}]
["DFENUM",{"$f":"'Special Rates 2024-25'!DFENUM","v":0},7032,{"$f":"IF(C2=C1,0,1)","v":0},7033,{"$f":"IF(E2=E1,0,1)","v":0},7044,{"$f":"IF(G2=G1,0,1)","v":0},7045,{"$f":"IF(I2=I1,0,1)","v":0},7062,{"$f":"IF(K2=K1,0,1)","v":0},7041,{"$f":"IF(M2=M1,0,1)","v":0},7067,{"$f":"IF(O2=O1,0,1)","v":0},7021,{"$f":"IF(Q2=Q1,0,1)","v":0},7002,{"$f":"IF(S2=S1,0,1)","v":0},7052,{"$f":"IF(U2=U1,0,1)","v":0},7058,{"$f":"IF(W2=W1,0,1)","v":0},7073,{"$f":"IF(Y2=Y1,0,1)","v":0},7039,{"$f":"IF(AA2=AA1,0,1)","v":0},7040,{"$f":"IF(AC2=AC1,0,1)","v":0},7043,{"$f":"IF(AE2=AE1,0,1)","v":0},7051,{"$f":"IF(AG2=AG1,0,1)","v":0},7056,{"$f":"IF(AI2=AI1,0,1)","v":0},7063,{"$f":"IF(AK2=AK1,0,1)","v":0},7066,{"$f":"IF(AM2=AM1,0,1)","v":0},7069,{"$f":"IF(AO2=AO1,0,1)","v":0},7070,{"$f":"IF(AQ2=AQ1,0,1)","v":0},7072,{"$f":"IF(AS2=AS1,0,1)","v":0},7005,{"$f":"IF(AU2=AU1,0,1)","v":0},7006,{"$f":"IF(AW2=AW1,0,1)","v":0}]
["NAME",{"$f":"[0]!NAME","v":""},"Bower Grove School",0,"St Anthony's School",0,"Rowhill School",0,"Elms School",0,"The Orchard School",0,"Goldwyn School",0,"Portal House School",0,"Valence School",0,"Broomhill Bank School",0,"Grange Park School",0,"Stone Bay School",0,"Laleham Gap School",0,"The Ifield School",0,"Foreland Fields School",0,"The Beacon Folkestone",0,"Nexus School",0,"Five Acre Wood School",0,"St Nicholas' School",0,"Milestone Academy",0,"The Wyvern School",0,"Oakley School",0,"Meadowfield School",0,"Aspire School",0,"Snowfields Academy",0]
["preold",{"$f":"[0]!preold","v":0},225,0,106,0,132,0,152,0,100,0,160,0,80,0,80,0,269,0,95,0,92,0,192,0,227,0,213,0,278,0,256,0,648,0,311,0,326,0,303,0,152,0,346,0,172,0,238,0]
["postold",{"$f":"[0]!postold","v":0},0,0,0,0,0,0,0,0,0,0,35,0,0,0,30,0,107,0,60,0,11,0,15,0,39,0,30,0,130,0,39,0,77,0,44,0,37,0,47,0,60,0,45,0,0,0,10,0]
["weekdayold",{"$f":"[0]!weekdayold","v":0},0,0,0,0,0,0,0,0,0,0,0,0,0,0,46,0,23,0,0,0,10,0,0,0,0,0,0,0,0,0,0,0,0,0,0,0,0,0,0,0,0,0,0,0,0,0,0,0]
["weekendold",{"$f":"[0]!weekendold","v":0},0,0,0,0,0,0,0,0,0,0,0,0,0,0,18,0,0,0,0,0,0,0,0,0,0,0,0,0,0,0,0,0,0,0,0,0,0,0,0,0,0,0,0,0,0,0,0,0]
["prenew",{"$f":"[0]!prenew","v":0},225,0,98,0,150,0,152,0,100,0,160,0,80,0,85,0,280,0,136,0,95,0,193,0,221,0,210,0,324,0,256,0,728,0,297,0,288,0,308,0,182,0,326,0,174,0,276,0]
["postnew",{"$f":"[0]!postnew","v":0},0,0,0,0,0,0,0,0,0,0,35,0,0,0,30,0,113,0,75,0,8,0,14,0,45,0,34,0,84,0,39,0,110,0,43,0,75,0,44,0,30,0,63,0,0,0,48,0]
["weekdaynew",{"$f":"[0]!weekdaynew","v":0},0,0,0,0,0,0,0,0,0,0,0,0,0,0,46,0,23,0,0,0,10,0,0,0,0,0,0,0,0,0,0,0,0,0,0,0,0,0,0,0,0,0,0,0,0,0,0,0]
["weekendnew",{"$f":"[0]!weekendnew","v":0},0,0,0,0,0,0,0,0,0,0,0,0,0,0,18,0,0,0,0,0,0,0,0,0,0,0,0,0,0,0,0,0,0,0,0,0,0,0,0,0,0,0,0,0,0,0,0,0]
["mldold",{"$f":"[0]!mldold","v":0},13127.347553302407,1,15742.591751911334,1,15037.603380229177,1,14070.895995288332,1,15651.573095924643,1,14272.480290141597,1,17365.601995190274,1,17394.493002952036,1,12804.867203637994,1,13798.359744098512,1,15454.478856899117,1,13301.464095190273,1,12983.308367283165,1,13239.869244457252,1,12468.812596802401,1,12925.807305305229,1,11680.123772737959,1,12936.509657373577,1,12887.729284075182,1,12379.691042569893,1,13427.381118167161,1,12465.121029961929,1,13559.263854082832,1,13424.022279933608,1]
["besdold",{"$f":"[0]!besdold","v":0},19736.950181766162,1,22352.194380375091,1,21708.113889783199,1,20680.498623752086,1,22261.175724388395,1,20882.082918605349,1,23975.204623654026,1,24056.476470506987,1,19430.439600117359,1,20407.962372562266,1,22064.081485362873,1,19911.066723654028,1,19592.910995746923,1,19849.471872921007,1,19078.415225266155,1,19535.40993376898,1,18289.726401201715,1,19546.112285837335,1,19549.712751630133,1,18989.293671033643,1,20036.983746630915,1,19074.723658425683,1,20168.866482546582,1,20033.62490839736,1]
["sldold",{"$f":"[0]!sldold","v":0},17518.565289532791,1,20133.80948814172,1,19514.150110471979,1,18462.113731518715,1,20042.790832155028,1,18663.698026371982,1,21756.819731420659,1,21871.039733194841,1,17222.099877067289,1,18189.577480328895,1,19845.696593129502,1,17692.681831420658,1,17374.526103513552,1,17631.086980687636,1,16860.030333032788,1,17317.025041535613,1,16071.341508968344,1,17327.727393603964,1,17364.276014317984,1,16770.908778800276,1,17818.598854397544,1,16856.338766192315,1,17950.481590313218,1,17815.240016163993,1]
["pdold",{"$f":"[0]!pdold","v":0},24836.502316157832,1,27451.746514766761,1,26974.198052180567,1,25780.050758143756,1,27360.727858780065,1,25981.635052997019,1,29074.756758045696,1,29331.087674903429,1,24583.363402193412,1,25507.514506953936,1,27163.633619754542,1,25010.618858045698,1,24692.463130138593,1,24949.024007312677,1,24177.967359657825,1,24634.96206816065,1,23389.278535593385,1,24645.664420229004,1,24824.323956026572,1,24088.845805425313,1,25136.535881022584,1,24174.275792817352,1,25268.418616938252,1,25133.17704278903,1]
["asdold",{"$f":"[0]!asdold","v":0},19736.950181766162,1,22352.194380375091,1,21782.164517669931,1,20680.498623752086,1,22261.175724388395,1,20882.082918605349,1,23975.204623654026,1,24139.054140392796,1,20266.116230258802,1,21213.892042524596,1,30123.37818498613,1,20716.996393616355,1,20398.840665709249,1,20655.401542883334,1,19884.344895228482,1,20341.339603731307,1,19095.656071164041,1,20352.041955799657,1,20453.212450979954,1,19795.22334099597,1,20842.913416593241,1,19880.653328388009,1,20974.796152508912,1,20839.554578359686,1]
["pdweekdayold",{"$f":"[0]!pdweekdayold","v":0},0,0,0,0,0,0,0,0,0,0,0,0,0,0,81961.150288363904,1,0,0,0,0,89945.859174761295,1,0,0,0,0,0,0,0,0,0,0,0,0,0,0,0,0,0,0,0,0,0,0,0,0,0,0]
["asdweekdayold",{"$f":"[0]!asdweekdayold","v":0},0,0,0,0,0,0,0,0,0,0,0,0,0,0,0,0,60392.657359487319,1,0,0,92905.60373999289,1,0,0,0,0,0,0,0,0,0,0,0,0,0,0,0,0,0,0,0,0,0,0,0,0,0,0]
["pdweekendold",{"$f":"[0]!pdweekendold","v":0},0,0,0,0,0,0,0,0,0,0,0,0,0,0,110399.80007296539,1,0,0,0,0,0,0,0,0,0,0,0,0,0,0,0,0,0,0,0,0,0,0,0,0,0,0,0,0,0,0,0,0]
["mldnew",{"$f":"[0]!mldnew","v":0},13157.650522372922,1,16153.306308405166,1,14536.028332559164,1,14081.633964642037,1,15653.339420651042,1,14950.624657464319,1,17404.542016112508,1,17132.950907778002,1,12815.238033700911,1,12923.160065815784,1,15473.230202498899,1,13269.110492910513,1,13016.33110195251,1,13269.995297984018,1,12608.131864611256,1,12942.253610655762,1,11564.771841487483,1,13064.063048165022,1,12896.537334642429,1,12383.795575967759,1,13432.34812206356,1,12497.169745763254,1,13538.875593834793,1,12749.282204163894,1]
{"$rows_left_out":34}