{"text_format":"1","workbook":"xlsx","n_sheets":3,"sheets":["Special Rates 2019-20","Nursery Lump Sums","newdatacalc"],"not_rendered":{"charts":0,"images":1,"macros":1,"external_links":0,"defined_names":24,"comments":0,"pivot_tables":0},"unopened":[],"bounds":{"document_bytes":16777216,"sheet_cells":100000,"rows_first":2000,"rows_last":500,"rows_between":2000,"halvings":0,"cell_chars":16384,"cell_head_chars":4096},"cells_cut":0,"cells_raw":0,"read":"whole","date_system":"1900"}

{"sheet":"Special Rates 2019-20","index":0,"n_rows":96,"n_cols":28,"rows_kept":96,"cut":false,"hidden":false,"merged":[[95,6,95,12],[37,6,37,8],[38,6,38,8],[39,6,39,8],[40,6,40,8],[42,6,42,8],[43,6,43,8],[44,6,44,8],[46,9,46,13],[48,1,48,8],[50,1,50,8],[49,1,49,8],[95,1,95,4],[51,1,51,8],[90,1,90,8],[94,1,94,4],[68,1,68,4],[52,1,52,8],[53,1,53,8],[54,1,54,8],[55,1,55,8],[56,1,56,8],[57,1,57,8],[75,1,75,4],[76,1,76,4],[77,1,77,4],[78,1,78,4],[79,1,79,4],[94,6,94,9],[22,23,22,27],[88,16,88,20],[88,23,88,27],[66,16,66,20],[46,16,46,20],[46,23,46,27],[66,23,66,27],[7,4,7,10],[30,1,30,6],[4,16,12,20],[33,1,33,6],[22,9,22,13],[22,16,22,20],[12,7,19,10],[26,1,26,7],[28,1,28,7],[1,15,2,19],[80,1,80,4],[81,1,81,4],[82,1,82,4],[88,9,88,13],[74,1,74,4],[58,1,58,8],[59,1,59,8],[60,1,60,8],[61,1,61,8],[69,1,69,4],[70,1,70,4],[71,1,71,4],[72,1,72,4],[73,1,73,4],[66,9,66,13]]}
[]
[]
[]
[null,null,null,null,"2019/20 Calculation of Special School Funding Rates"]
[]
[]
[]
[null,"DfE",null,null,{"$f":"IFERROR(VLOOKUP(DFENUM,newdatacalc!$A$33:$BJ$55,2,0),\"\")","v":""}]
[]
[]
[null,"Section 1 - Commissioned Place numbers"]
[]
[null,"Academic Year","Pre-16","Post-16","Weekday Residential","Weekend Residential",null,"High Needs Place numbers as agreed annually with the Local Authority's SEN team.\n\nPlace numbers 2018-19 agreed November 2017\n\n\nPlace numbers 2019-20 agreed November 2018"]
[]
[null,"2018/19",{"$f":"IFERROR(VLOOKUP(DFENUM,newdatacalc!$A$33:$BO$55,66,0),0)","v":0},{"$f":"IFERROR(VLOOKUP(DFENUM,newdatacalc!$A$33:$BO$55,67,0),0)","v":0},{"$f":"IFERROR(VLOOKUP(DFENUM,newdatacalc!$A$33:$BO$55,64,0),0)","v":0},{"$f":"IFERROR(VLOOKUP(DFENUM,newdatacalc!$A$33:$BO$55,65,0),0)","v":0}]
[]
[null,"2019/20",{"$f":"IFERROR(VLOOKUP(DFENUM,newdatacalc!$A$33:$BO$55,61,0),0)","v":0},{"$f":"IFERROR(VLOOKUP(DFENUM,newdatacalc!$A$33:$BO$55,62,0),0)","v":0},{"$f":"IFERROR(VLOOKUP(DFENUM,newdatacalc!$A$33:$BO$55,59,0),0)","v":0},{"$f":"IFERROR(VLOOKUP(DFENUM,newdatacalc!$A$33:$BO$55,60,0),0)","v":0}]
[]
[null,"Movement",{"$f":"C17-C15","v":0},{"$f":"D17-D15","v":0},{"$f":"E17-E15","v":0},{"$f":"F17-F15","v":0}]
[]
[]
[]
[null,null,null,null,null,null,null,null,null,"Day Pupil",null,null,null,null,null,null,"Weekday",null,null,null,null,null,null,"Weekend"]
[null,"Section 2 - Calculation of funding rate for April 2019 to March 2020"]
[null,null,null,null,null,null,null,null,null,"MLD & SLCN","BESD","SLD","PD & PMLD","ASD",null,null,"MLD & SLCN","BESD","SLD","PD & PMLD","ASD",null,null,"MLD & SLCN","BESD","SLD","PD & PMLD","ASD"]
[]
["(A)","April 2019 to August 2019 (Formula only excluding MFG)- based on  Academic Year 2018 to 2019. Data taken from 2018-19 Funding Rates Calculation.",null,null,null,null,null,null,null,{"$f":"IFERROR(VLOOKUP('Special Rates 2019-20'!DFENUM,newdatacalc!$A$33:$BT$55,23,0),0)","v":0},{"$f":"IFERROR(VLOOKUP('Special Rates 2019-20'!DFENUM,newdatacalc!$A$33:$BT$55,24,0),0)","v":0},{"$f":"IFERROR(VLOOKUP('Special Rates 2019-20'!DFENUM,newdatacalc!$A$33:$BT$55,25,0),0)","v":0},{"$f":"IFERROR(VLOOKUP('Special Rates 2019-20'!DFENUM,newdatacalc!$A$33:$BT$55,26,0),0)","v":0},{"$f":"IFERROR(VLOOKUP('Special Rates 2019-20'!DFENUM,newdatacalc!$A$33:$BT$55,27,0),0)","v":0},null,null,{"$f":"VLOOKUP('Special Rates 2019-20'!DFENUM,newdatacalc!$A$33:$AK$55,28,0)","v":{"$error":"#N/A"}},{"$f":"VLOOKUP('Special Rates 2019-20'!DFENUM,newdatacalc!$A$33:$AK$55,29,0)","v":{"$error":"#N/A"}},{"$f":"VLOOKUP('Special Rates 2019-20'!DFENUM,newdatacalc!$A$33:$AK$55,30,0)","v":{"$error":"#N/A"}},{"$f":"VLOOKUP('Special Rates 2019-20'!DFENUM,newdatacalc!$A$33:$AK$55,31,0)","v":{"$error":"#N/A"}},{"$f":"VLOOKUP('Special Rates 2019-20'!DFENUM,newdatacalc!$A$33:$AK$55,32,0)","v":{"$error":"#N/A"}},null,null,{"$f":"VLOOKUP('Special Rates 2019-20'!DFENUM,newdatacalc!$A$33:$AK$55,33,0)","v":{"$error":"#N/A"}},{"$f":"VLOOKUP('Special Rates 2019-20'!DFENUM,newdatacalc!$A$33:$AK$55,34,0)","v":{"$error":"#N/A"}},{"$f":"VLOOKUP('Special Rates 2019-20'!DFENUM,newdatacalc!$A$33:$AK$55,35,0)","v":{"$error":"#N/A"}},{"$f":"VLOOKUP('Special Rates 2019-20'!DFENUM,newdatacalc!$A$33:$AK$55,36,0)","v":{"$error":"#N/A"}},{"$f":"VLOOKUP('Special Rates 2019-20'!DFENUM,newdatacalc!$A$33:$AK$55,37,0)","v":{"$error":"#N/A"}}]
[]
["(B)","September 2019 to March 2020 (Formula only excluding MFG)- based on  Academic Year 2019 to 2020. See section 3 for calculation.",null,null,null,null,null,null,null,{"$f":"J91","v":9128.0078132573672},{"$f":"K91","v":11039.860388627309},{"$f":"L91","v":12995.848063983196},19441.579768500109,14949.829600127208,null,null,{"$f":"Q91","v":{"$error":"#N/A"}},{"$f":"R91","v":{"$error":"#N/A"}},{"$error":"#N/A"},{"$error":"#N/A"},{"$error":"#N/A"},null,null,{"$f":"X91","v":{"$error":"#N/A"}},{"$f":"Y91","v":{"$error":"#N/A"}},{"$error":"#N/A"},{"$error":"#N/A"},{"$error":"#N/A"}]
[]
["(C)","April 2019 to March 2020 - based on Academic Year 2018 to 2019 (April 2019 to August 2019) 5/12's + Academic Year 2019 to 2020 (September 2019 to March 2020) 7/12's",null,null,null,null,null,null,"=  (A) X 5/12 \n           + \n    (B) X 7/12",{"$f":"(J27*5/12)+(J29*7/12)","v":5324.671224400131},{"$f":"(K27*5/12)+(K29*7/12)","v":6439.9185600325973},{"$f":"(L27*5/12)+(L29*7/12)","v":7580.9113706568642},{"$f":"(M27*5/12)+(M29*7/12)","v":11340.921531625063},{"$f":"(N27*5/12)+(N29*7/12)","v":8720.7339334075386},null,null,{"$f":"(Q27*5/12)+(Q29*7/12)","v":{"$error":"#N/A"}},{"$f":"(R27*5/12)+(R29*7/12)","v":{"$error":"#N/A"}},{"$f":"(S27*5/12)+(S29*7/12)","v":{"$error":"#N/A"}},{"$f":"(T27*5/12)+(T29*7/12)","v":{"$error":"#N/A"}},{"$f":"(U27*5/12)+(U29*7/12)","v":{"$error":"#N/A"}},null,null,{"$f":"(X27*5/12)+(X29*7/12)","v":{"$error":"#N/A"}},{"$f":"(Y27*5/12)+(Y29*7/12)","v":{"$error":"#N/A"}},{"$f":"(Z27*5/12)+(Z29*7/12)","v":{"$error":"#N/A"}},{"$f":"(AA27*5/12)+(AA29*7/12)","v":{"$error":"#N/A"}},{"$f":"(AB27*5/12)+(AB29*7/12)","v":{"$error":"#N/A"}}]
[]
["(D-input)","Final funding rate for financial Year 2018 to 2019",null,null,null,null,null,null,null,{"$f":"IFERROR(VLOOKUP('Special Rates 2019-20'!DFENUM,newdatacalc!$A$33:$BT$55,40,0),0)","v":0},{"$f":"IFERROR(VLOOKUP('Special Rates 2019-20'!DFENUM,newdatacalc!$A$33:$BT$55,41,0),0)","v":0},{"$f":"IFERROR(VLOOKUP('Special Rates 2019-20'!DFENUM,newdatacalc!$A$33:$BT$55,42,0),0)","v":0},{"$f":"IFERROR(VLOOKUP('Special Rates 2019-20'!DFENUM,newdatacalc!$A$33:$BT$55,43,0),0)","v":0},{"$f":"IFERROR(VLOOKUP('Special Rates 2019-20'!DFENUM,newdatacalc!$A$33:$BT$55,44,0),0)","v":0},null,null,{"$f":"VLOOKUP('Special Rates 2019-20'!DFENUM,newdatacalc!$A$33:$BT$55,45,0)","v":{"$error":"#N/A"}},{"$f":"VLOOKUP('Special Rates 2019-20'!DFENUM,newdatacalc!$A$33:$BT$55,46,0)","v":{"$error":"#N/A"}},{"$f":"VLOOKUP('Special Rates 2019-20'!DFENUM,newdatacalc!$A$33:$BT$55,47,0)","v":{"$error":"#N/A"}},{"$f":"VLOOKUP('Special Rates 2019-20'!DFENUM,newdatacalc!$A$33:$BT$55,48,0)","v":{"$error":"#N/A"}},{"$f":"VLOOKUP('Special Rates 2019-20'!DFENUM,newdatacalc!$A$33:$BT$55,49,0)","v":{"$error":"#N/A"}},null,null,{"$f":"VLOOKUP('Special Rates 2019-20'!DFENUM,newdatacalc!$A$33:$BD$55,50,0)","v":{"$error":"#N/A"}},{"$f":"VLOOKUP('Special Rates 2019-20'!DFENUM,newdatacalc!$A$33:$BD$55,51,0)","v":{"$error":"#N/A"}},{"$f":"VLOOKUP('Special Rates 2019-20'!DFENUM,newdatacalc!$A$33:$BD$55,52,0)","v":{"$error":"#N/A"}},{"$f":"VLOOKUP('Special Rates 2019-20'!DFENUM,newdatacalc!$A$33:$BD$55,53,0)","v":{"$error":"#N/A"}},{"$f":"VLOOKUP('Special Rates 2019-20'!DFENUM,newdatacalc!$A$33:$BD$55,54,0)","v":{"$error":"#N/A"}}]
["(D)","MFG rate (D-input) X 98.5%",null,null,null,null,null,null,null,{"$f":"J33*0.985","v":0},{"$f":"K33*0.985","v":0},0,0,{"$f":"N33*0.985","v":0},null,null,{"$f":"Q33*0.985","v":{"$error":"#N/A"}},{"$f":"R33*0.985","v":{"$error":"#N/A"}},{"$error":"#N/A"},{"$error":"#N/A"},{"$f":"U33*0.985","v":{"$error":"#N/A"}},null,null,{"$f":"X33*0.985","v":{"$error":"#N/A"}},{"$f":"Y33*0.985","v":{"$error":"#N/A"}},{"$error":"#N/A"},{"$error":"#N/A"},{"$error":"#N/A"}]
[]
[]
[null,null,null,null,null,null,null,null,null,"MLD & SLCN","BESD","SLD","PD & PMLD","ASD",null,null,"MLD & SLCN","BESD","SLD","PD & PMLD","ASD",null,null,"MLD & SLCN","BESD","SLD","PD & PMLD","ASD"]
["(E)","Final Rate (Greater of Formula (C) or MFG (D))",null,null,null,null,"Formula (C)",null,null,{"$f":"J31","v":5324.671224400131},{"$f":"K31","v":6439.9185600325973},{"$f":"L31","v":7580.9113706568642},{"$f":"M31","v":11340.921531625063},{"$f":"N31","v":8720.7339334075386},null,"Formula",{"$f":"Q31","v":{"$error":"#N/A"}},{"$f":"R31","v":{"$error":"#N/A"}},{"$f":"S31","v":{"$error":"#N/A"}},{"$f":"T31","v":{"$error":"#N/A"}},{"$f":"U31","v":{"$error":"#N/A"}},null,"Formula",{"$f":"X31","v":{"$error":"#N/A"}},{"$f":"Y31","v":{"$error":"#N/A"}},{"$f":"Z31","v":{"$error":"#N/A"}},{"$f":"AA31","v":{"$error":"#N/A"}},{"$f":"AB31","v":{"$error":"#N/A"}}]
[null,null,null,null,null,null,"MFG funding rate (D)",null,null,{"$f":"J34","v":0},{"$f":"K34","v":0},0,0,0,null,"MFG",{"$f":"Q34","v":{"$error":"#N/A"}},{"$f":"R34","v":{"$error":"#N/A"}},{"$error":"#N/A"},{"$error":"#N/A"},{"$error":"#N/A"},null,"MFG",{"$f":"X34","v":{"$error":"#N/A"}},{"$f":"Y34","v":{"$error":"#N/A"}},{"$error":"#N/A"},{"$error":"#N/A"},{"$error":"#N/A"}]
[null,null,null,null,null,null,"Amount of MFG if (D) is greater than ( C)",null,null,{"$f":"IF(J38>J39,0,J39-J38)","v":0},{"$f":"IF(K38>K39,0,K39-K38)","v":0},0,0,0,null,"Amount of MFG if (D) is greater than ( C)",{"$f":"IF(Q38>Q39,0,Q39-Q38)","v":{"$error":"#N/A"}},{"$error":"#N/A"},{"$error":"#N/A"},{"$error":"#N/A"},{"$error":"#N/A"},null,"Amount of MFG if (D) is greater than ( C)",{"$f":"IF(X38>X39,0,X39-X38)","v":{"$error":"#N/A"}},{"$f":"IF(Y38>Y39,0,Y39-Y38)","v":{"$error":"#N/A"}},{"$error":"#N/A"},{"$error":"#N/A"},{"$error":"#N/A"}]
{"$rows_left_out":57}
{"sheet":"Nursery Lump Sums","index":1,"n_rows":113,"n_cols":10,"rows_kept":113,"cut":false,"hidden":false,"merged":[]}
[]
[null,"2019/20 Nursery Provision Lump Sum Calculation"]
[]
[]
[null,null,"Rates"]
[]
[null,null,"Leadership Lump Sum per provision",50000,null,null,null,null,"Day Rate Breakdown"]
[null,null,"Day Rate per FTE (see breakdown)",8681.57]
[null,null,null,null,null,null,null,null,"Support Staff",7073.65]
[null,null,"Calculation",null,null,null,null,null,"Other Staffing",1003.07]
[null,null,null,null,null,null,null,null,"Resources",354.08]
[null,null,null,"Units","Rate","Total",null,null,"Training/Sundry",250.77]
[null,null,"Leadership Lump Sum",{"$f":"IFERROR(VLOOKUP(DFENUM,newdatacalc!$A$33:$BS$55,4,0),0)","v":0},50000,{"$f":"IFERROR(E13*D13,\"TBC\")","v":0},null,null,"Total FTE Funding",8681.57]
[null,null,"Day Rate",{"$f":"IFERROR(VLOOKUP(DFENUM,newdatacalc!$A$33:$BS$55,5,0),0)","v":0},8681.57,{"$f":"IFERROR(E14*D14,\"TBC\")","v":0}]
[]
[null,null,null,null,"Total Funding at this provision:",{"$f":"IFERROR(F14+F13,\"TBC\")","v":0}]
[]
[]
[null,null,"This funding will be provided in twelve equal instalments (except where a Nursery provision is commissioned to start in-year)"]
[]
[]
[]
[]
[]
[]
[]
[]
[]
[]
[]
[]
[]
[]
[]
[]
[]
[]
[]
[]
[]
{"$rows_left_out":74}
{"sheet":"newdatacalc","index":2,"n_rows":56,"n_cols":89,"rows_kept":56,"cut":false,"hidden":true,"merged":[[3,14,3,16],[31,57,31,61],[31,62,31,66],[31,22,31,26],[31,27,31,31],[31,32,31,36],[31,39,31,43],[31,44,31,48],[31,49,31,53]]}
[1,2,3,4,5,6,7,8,9,10,11,12,13,14,15,16,17,18,19,20,21,22,23,24,25,26,27,28,29,30,31,32,33,34,35,36,40,37,38,39,41,42,43,44,45,46,47,48,49,50,51,52,53,54,55,56,57,58,59,60,61,62,63,64,65,66,67,68,69,70,71,72,73,74,89,90,91,92,93,94,95,96,97,98,99,100,101,102,103]
[]
[]
["Calc",null,null,21796.724279993101,14697.993577082399,14697.993577082399,10788.0243655825,null,null,null,null,null,null,null,"Section 4 - Units"]
["Dfe","School","Type","ASD High rate","ASD Low Rate","BESD High rate","BESD Low Rate",null,"Dfe","Primary Pupils","Secondary Pupils","Total Pupils","% primary","25% BESD2","Specialist School","Lump sum day","Lump sum day catering","London Fridge Dat rate"]
[7032,"Bower Grove School","B&L",0,1,0.10044642857142858,0.8995535714285714,null,7032,45,67,112,0.4017857142857143,0.10044642857142858,1,1,1,3854.25]
[7033,"St Anthony's School","B&L",0,1,9.166666666666666E-2,0.90833333333333333,null,7033,22,38,60,0.36666666666666664,9.166666666666666E-2,1,1,1,3854.25]
[7044,"Rowhill School","B&L",0,1,0.11403508771929824,0.88596491228070173,null,7044,26,31,57,0.45614035087719296,0.11403508771929824,1,1,1,3854.25]
[7045,"Elms School","B&L",0,1,0.10164835164835165,0.89835164835164838,null,7045,37,54,91,0.40659340659340659,0.10164835164835165,1,1,1,3854.25]
[7062,"The Orchard School","B&L",0,1,7.6612903225806453E-2,0.92338709677419351,null,7062,19,43,62,0.30645161290322581,7.6612903225806453E-2,1,1,1,3854.25]
[7041,"Goldwyn Community Special School","BESD",0,1,0.75,0.25,null,null,null,null,null,null,null,1,1,1,3854.25]
[7067,"Portal House School","BESD",0,1,0.75,0.25,null,null,null,null,null,null,null,1,1,1,3854.25]
[7002,"Broomhill Bank School","C&I",0.1,0.9,0,1,null,null,null,null,null,null,null,1,1,1,3854.25]
[7052,"Grange Park School","C&I",0.1,0.9,0,1,null,null,null,null,null,null,null,1,1,1,3854.25]
[7058,"Stone Bay School","C&I",1,0,0,1,null,null,null,null,null,null,null,1,1,1,3854.25]
[7073,"Laleham Gap School","C&I",0.1,0.9,0,1,null,null,null,null,null,null,null,1,1,1,3854.25]
[7021,"Valence School","PD",0,1,0,1,null,null,null,null,null,null,null,1,1,1,3854.25]
[7039,"The Ifield School","PSCN",0.1,0.9,0,1,null,null,null,null,null,null,null,1,1,1,3854.25]
[7040,"Foreland Fields School","PSCN",0.1,0.9,0,1,null,null,null,null,null,null,null,1,1,1,3854.25]
[7043,"The Beacon Folkestone","PSCN",0.1,0.9,0,1,null,null,null,null,null,null,null,1,1,1,3854.25]
[7051,"Nexus School","PSCN",0.1,0.9,0,1,null,null,null,null,null,null,null,1,1,1,3854.25]
[7056,"Five Acre Wood School","PSCN",0.1,0.9,0,1,null,null,null,null,null,null,null,1,1,1,3854.25]
[7063,"St Nicholas' School","PSCN",0.1,0.9,0,1,null,null,null,null,null,null,null,1,1,1,3854.25]
[7066,"Milestone School","PSCN",0.1,0.9,0,1,null,null,null,null,null,null,null,1,1,1,3854.25]
[7069,"The Wyvern School","PSCN",0.1,0.9,0,1,null,null,null,null,null,null,null,1,1,1,3854.25]
[7070,"Oakley School","PSCN",0.1,0.9,0,1,null,null,null,null,null,null,null,1,1,1,3854.25]
[7072,"Meadowfield School","PSCN",0.1,0.9,0,1,null,null,null,null,null,null,null,1,1,1,3854.25]
[]
[1,2,3,4,5,6,7,8,9,10,11,12,13,14,15,16,17,18,19,20,21,22,23,24,25,26,27,28,29,30,31,32,33,34,35,36,37,38,39,40,41,42,43,44,45,46,47,48,49,50,51,52,53,54,55,56,57,58,59,60,61,62,63,64,65,66,67,68,69,70,71,72,73,74,75,76,77,78,79,80,81,82,83,84,85,86,87,88,89]
[]
[null,null,null,null,null,null,null,null,null,null,null,null,null,null,null,null,null,null,null,null,null,null,null,null,null,null,null,null,null,null,null,null,null,null,null,null,null,null,null,null,null,null,null,null,null,null,null,null,null,null,null,null,null,null,null,null,null,4457,91,16,3955,593,4022,92,16,3552,578]
["Data",null,null,null,null,null,null,null,null,null,null,null,null,null,null,null,null,null,null,null,null,38427,"DAY April to August 2019 (A) ",null,null,null,null,"WeekDay April to August 2019 (A) ",null,null,null,null,"WeekEnd April to August 2019 (A) ",null,null,null,null,null,null,"DAY 2018-19 FY funding rate + MFG (D input) ",null,null,null,null,"WEEKDAY 2018-19 FY funding rate + MFG (D input) ",null,null,null,null,"WEEKEND 2018-19 FY funding rate + MFG (D input) ",null,null,null,null,null,null,null,"Place data (19/20)",null,null,null,null,"Place data (18/19)"]
["Dfe","School","Type","Nursery","Nursery FTE",null,"Gross Day Floor Area (m2)","Residential Floor Area Weekday (m2)","Residential Floor Area Weekend (m2)","Grounds Site Area (hectares)","Rentals","Rentals","Lump sum standard","lump sum catering day","lump sum residential","lump sum residential rate","Hydrotherapy Pool","% FSM","London Fringe ","Split site- Band  1","Split site - Band 2","split site 2 rate","MLD & SLCN","BESD","SLD","PD & PMLD","ASD","MLD & SLCN","BESD","SLD","PD & PMLD","ASD","MLD & SLCN","BESD","SLD","PD & PMLD","ASD",null,null,"MLD & SLCN","BESD","SLD","PD & PMLD","ASD","MLD & SLCN","BESD","SLD","PD & PMLD","ASD","MLD & SLCN","BESD","SLD","PD & PMLD","ASD",null,null,null,"Day","Res Weekday","Res Weekend","Pre-16","Post-16","Day","Res Weekday","Res Weekend","Pre-16","Post-16",null,"Residential weekday","Residential Weekend","Residential Weekday Places- Catering","Residential Weekend Places Catering"]
[7032,"Bower Grove School","B&L",0,0,null,4093,0,0,2.1496,0,0,1,1,0,0,0,0.3888888888888889,0,1,0,0,11598.049156258197,13915.653253576251,15465.889406984026,21911.621111500936,17419.870943128069,null,null,null,null,null,null,null,null,null,null,null,null,11617.028080732343,13940.121240847313,15484.868331458172,21930.60003597508,17438.849867602214,null,null,null,null,null,null,null,null,null,null,null,null,null,214,0,0,214,0,212,0,0,212,0,null,0,0,0,0]
[7033,"St Anthony's School","B&L",0,0,null,3614,0,0,1.54,0,0,1,1,0,0,0,0.5092592592592593,0,0,0,0,14135.448469849813,16384.367356555962,18003.288720575641,24449.020425092553,19957.27025671969,null,null,null,null,null,null,null,null,null,null,null,null,14187.500284703747,16438.883106434281,18055.340535429572,24501.072239946483,20009.322071573624,null,null,null,null,null,null,null,null,null,null,null,null,null,98,0,0,98,0,98,0,0,98,0,null,0,0,0,0]
[7044,"Rowhill School","B&L",0,0,null,4165,0,0,1.8948,0,0,1,1,0,0,0,0.57407407407407407,1,0,0,0,13966.777790759388,16336.025620692028,17909.776901150071,24480.681701251055,19907.472743241698,null,null,null,null,null,null,null,null,null,null,null,null,13959.458977855003,16332.514748041762,17902.458088245687,24473.36288834667,19900.153930337314,null,null,null,null,null,null,null,null,null,null,null,null,null,110,0,0,110,0,110,0,0,110,0,null,0,0,0,0]
[7045,"Elms School","B&L",0,0,null,2771,0,0,2.13,0,0,1,1,0,0,0,0.63846153846153841,0,0,0,0,13251.090093067698,15488.77343606264,17118.930343793527,23564.662048310442,19072.911879937576,null,null,null,null,null,null,null,null,null,null,null,null,13247.631759734364,15492.65363353167,17115.472010460195,23561.203714977106,19069.453546604243,null,null,null,null,null,null,null,null,null,null,null,null,null,158,0,0,158,0,115,0,0,115,0,null,0,0,0,0]
[7062,"The Orchard School","B&L",0,0,null,2505,0,0,1.81,0,0,1,1,0,0,0,0.45555555555555555,0,0,0,0,14579.372461534729,16790.779129721202,18447.212712260556,24892.944416777471,20401.194248404601,null,null,null,null,null,null,null,null,null,null,null,null,14670.309170336583,16858.723748065648,18538.149421062415,24983.881125579326,20492.13095720646,null,null,null,null,null,null,null,null,null,null,null,null,null,83,0,0,83,0,83,0,0,83,0,null,0,0,0,0]
[7041,"Goldwyn Community Special School","BESD",0,0,null,5362.3800899999997,0,0,7.3492000000000006,0,0,1,1,0,0,0,0.36690647482014388,0,1,1,38427,13079.934584334449,17924.264068329343,16947.774835060278,23393.506539577193,18901.756371204327,null,null,null,null,null,null,null,null,null,null,null,null,14320.84595566911,18760.377643973214,17842.554113694074,23711.479411595286,19621.686575646214,null,null,null,null,null,null,null,null,null,null,null,null,null,150,0,0,150,0,150,0,0,150,0,null,0,0,0,0]
[7067,"Portal House School","BESD",0,0,null,3091,0,0,0.81,0,0,1,1,0,0,0,0.22413793103448276,0,0,0,0,16828.521504380384,21672.850988375274,20696.361755106209,27142.093459623124,22650.343291250258,null,null,null,null,null,null,null,null,null,null,null,null,16842.304716940769,21686.634200935659,20710.144967666594,27155.876672183513,22664.126503810643,null,null,null,null,null,null,null,null,null,null,null,null,null,80,0,0,80,0,60,0,0,60,0,null,0,0,0,0]
{"$rows_left_out":16}