{"text_format":"1","workbook":"xlsx","n_sheets":11,"sheets":["Testarea","Growth Data","Contents","Data","Home","Place Plus","Early Years","High Needs Mainstream","Specialist Resourced Provision","Growth Funding","SRP Rates"],"not_rendered":{"charts":0,"images":2,"macros":1,"external_links":0,"defined_names":30,"comments":0,"pivot_tables":0},"unopened":[],"bounds":{"document_bytes":16777216,"sheet_cells":100000,"rows_first":2000,"rows_last":500,"rows_between":2000,"halvings":0,"cell_chars":16384,"cell_head_chars":4096},"cells_cut":0,"cells_raw":0,"read":"whole","date_system":"1900"}

{"sheet":"Testarea","index":0,"n_rows":209,"n_cols":35,"rows_kept":209,"cut":false,"hidden":true,"merged":[]}
["DfE","School name","Early years","Ref",{"$f":"SUM(E2:E169)","v":0},"SEN topup","Ref",{"$f":"SUM(H2:H169)","v":59176.6},"SEN max","Ref",{"$f":"SUM(K2:K169)","v":0},"SRP1pre£","Ref",{"$f":"SUM(N2:N169)","v":0},"SRP1post£","Ref",{"$f":"SUM(Q2:Q169)","v":0},"SRP2pre£","Ref",{"$f":"SUM(T2:T169)","v":-1231.5500000000002},"SRP2post£","Ref",{"$f":"SUM(W2:W169)","v":-1121.0900000000001},"Place check","Ref",{"$f":"SUM(Z2:Z169)","v":0},"Lower Threshold","Ref",{"$f":"SUM(AC2:AC169)","v":169},"Qual year","Ref",{"$f":"SUM(AF2:AF169)","v":14},"Upper Threshold","Ref",{"$f":"SUM(AI2:AI209)","v":15}]
[2001,"Horizon Primary Academy",0,0,{"$f":"C2-D2","v":0},0,null,{"$f":"ROUND(F2-G2,2)","v":0},0,null,{"$f":"ROUND(I2-J2,2)","v":0},0,null,{"$f":"ROUND(L2-M2,2)","v":0},0,null,{"$f":"ROUND(O2-P2,2)","v":0},0,0,{"$f":"ROUND(R2-S2,2)","v":0},0,0,{"$f":"ROUND(U2-V2,2)","v":0},null,null,{"$f":"X2-Y2","v":0},0,{"$f":"IF(ISERROR(VLOOKUP(A2+8860000,'Growth Data'!A:F,6,0)),0,VLOOKUP(A2+8860000,'Growth Data'!A:F,6,0))","v":0},{"$f":"IF(AD2=\"YES\",AA2-AB2,0)","v":0},"NO",{"$f":"IF(ISERROR(VLOOKUP(A2+8860000,'Growth Data'!A:C,3,0)),\"NO\",VLOOKUP(A2+8860000,'Growth Data'!A:C,3,0))","v":"NO"},{"$f":"IF(AD2=AE2,0,1)","v":0},0,{"$f":"IF(ISERROR(VLOOKUP(A2+8860000,'Growth Data'!A:G,7,0)),0,VLOOKUP(A2+8860000,'Growth Data'!A:G,7,0))","v":0},{"$f":"IF(AG2=AH2,0,1)","v":0}]
[2003,"Oaks Primary Academy",4.93,4.9300000000000006,0,0,null,{"$f":"ROUND(F3-G3,2)","v":0},0,null,{"$f":"ROUND(I3-J3,2)","v":0},0,null,0,0,null,0,0,0,0,0,0,0,null,null,0,0,{"$f":"IF(ISERROR(VLOOKUP(A3+8860000,'Growth Data'!A:F,6,0)),0,VLOOKUP(A3+8860000,'Growth Data'!A:F,6,0))","v":0},{"$f":"IF(AD3=\"YES\",AA3-AB3,0)","v":0},"NO",{"$f":"IF(ISERROR(VLOOKUP(A3+8860000,'Growth Data'!A:C,3,0)),\"NO\",VLOOKUP(A3+8860000,'Growth Data'!A:C,3,0))","v":"NO"},0,0,{"$f":"IF(ISERROR(VLOOKUP(A3+8860000,'Growth Data'!A:G,7,0)),0,VLOOKUP(A3+8860000,'Growth Data'!A:G,7,0))","v":0},{"$f":"IF(AG3=AH3,0,1)","v":0}]
[2004,"Tree Tops Primary Academy",5.18,5.1800000000000006,0,0,null,0,0,null,0,0,null,0,0,null,0,0,0,0,0,0,0,null,null,0,0,{"$f":"IF(ISERROR(VLOOKUP(A4+8860000,'Growth Data'!A:F,6,0)),0,VLOOKUP(A4+8860000,'Growth Data'!A:F,6,0))","v":0},0,"NO",{"$f":"IF(ISERROR(VLOOKUP(A4+8860000,'Growth Data'!A:C,3,0)),\"NO\",VLOOKUP(A4+8860000,'Growth Data'!A:C,3,0))","v":"NO"},0,0,{"$f":"IF(ISERROR(VLOOKUP(A4+8860000,'Growth Data'!A:G,7,0)),0,VLOOKUP(A4+8860000,'Growth Data'!A:G,7,0))","v":0},0]
[2006,"St James the Great Academy",5.0599999999999996,5.0600000000000005,0,0,null,0,0,null,0,0,null,0,0,null,0,0,0,0,0,0,0,null,null,0,0,{"$f":"IF(ISERROR(VLOOKUP(A5+8860000,'Growth Data'!A:F,6,0)),0,VLOOKUP(A5+8860000,'Growth Data'!A:F,6,0))","v":0},0,"NO",{"$f":"IF(ISERROR(VLOOKUP(A5+8860000,'Growth Data'!A:C,3,0)),\"NO\",VLOOKUP(A5+8860000,'Growth Data'!A:C,3,0))","v":"NO"},0,0,{"$f":"IF(ISERROR(VLOOKUP(A5+8860000,'Growth Data'!A:G,7,0)),0,VLOOKUP(A5+8860000,'Growth Data'!A:G,7,0))","v":0},0]
[2007,"Molehill Primary Academy",0,0,0,0,null,0,0,null,0,0,null,0,0,null,0,0,0,0,0,0,0,null,null,0,0,{"$f":"IF(ISERROR(VLOOKUP(A6+8860000,'Growth Data'!A:F,6,0)),0,VLOOKUP(A6+8860000,'Growth Data'!A:F,6,0))","v":0},0,"NO",{"$f":"IF(ISERROR(VLOOKUP(A6+8860000,'Growth Data'!A:C,3,0)),\"NO\",VLOOKUP(A6+8860000,'Growth Data'!A:C,3,0))","v":"NO"},0,0,{"$f":"IF(ISERROR(VLOOKUP(A6+8860000,'Growth Data'!A:G,7,0)),0,VLOOKUP(A6+8860000,'Growth Data'!A:G,7,0))","v":0},0]
[2008,"Tiger Primary School",0,0,0,0,null,0,0,null,0,0,null,0,0,null,0,0,0,0,0,0,0,null,null,0,0,{"$f":"IF(ISERROR(VLOOKUP(A7+8860000,'Growth Data'!A:F,6,0)),0,VLOOKUP(A7+8860000,'Growth Data'!A:F,6,0))","v":0},0,"NO",{"$f":"IF(ISERROR(VLOOKUP(A7+8860000,'Growth Data'!A:C,3,0)),\"NO\",VLOOKUP(A7+8860000,'Growth Data'!A:C,3,0))","v":"NO"},0,0,{"$f":"IF(ISERROR(VLOOKUP(A7+8860000,'Growth Data'!A:G,7,0)),0,VLOOKUP(A7+8860000,'Growth Data'!A:G,7,0))","v":0},0]
[2009,"Northdown Primary School",5.45,5.45,0,0,null,0,0,null,0,0,null,0,0,null,0,0,0,0,0,0,0,null,null,0,45,{"$f":"IF(ISERROR(VLOOKUP(A8+8860000,'Growth Data'!A:F,6,0)),0,VLOOKUP(A8+8860000,'Growth Data'!A:F,6,0))","v":45},0,"YES",{"$f":"IF(ISERROR(VLOOKUP(A8+8860000,'Growth Data'!A:C,3,0)),\"NO\",VLOOKUP(A8+8860000,'Growth Data'!A:C,3,0))","v":"Yes"},0,60,{"$f":"IF(ISERROR(VLOOKUP(A8+8860000,'Growth Data'!A:G,7,0)),0,VLOOKUP(A8+8860000,'Growth Data'!A:G,7,0))","v":60},0]
[2010,"Newlands Primary School",0,0,0,0,null,0,0,null,0,0,null,0,0,null,0,0,0,0,0,0,0,null,null,0,0,{"$f":"IF(ISERROR(VLOOKUP(A9+8860000,'Growth Data'!A:F,6,0)),0,VLOOKUP(A9+8860000,'Growth Data'!A:F,6,0))","v":0},0,"NO",{"$f":"IF(ISERROR(VLOOKUP(A9+8860000,'Growth Data'!A:C,3,0)),\"NO\",VLOOKUP(A9+8860000,'Growth Data'!A:C,3,0))","v":"NO"},0,0,{"$f":"IF(ISERROR(VLOOKUP(A9+8860000,'Growth Data'!A:G,7,0)),0,VLOOKUP(A9+8860000,'Growth Data'!A:G,7,0))","v":0},0]
[2011,"Salmestone Primary School",4.97,4.9700000000000006,0,0,null,0,0,null,0,0,null,0,0,null,0,0,0,0,0,0,0,null,null,0,0,{"$f":"IF(ISERROR(VLOOKUP(A10+8860000,'Growth Data'!A:F,6,0)),0,VLOOKUP(A10+8860000,'Growth Data'!A:F,6,0))","v":0},0,"NO",{"$f":"IF(ISERROR(VLOOKUP(A10+8860000,'Growth Data'!A:C,3,0)),\"NO\",VLOOKUP(A10+8860000,'Growth Data'!A:C,3,0))","v":"NO"},0,0,{"$f":"IF(ISERROR(VLOOKUP(A10+8860000,'Growth Data'!A:G,7,0)),0,VLOOKUP(A10+8860000,'Growth Data'!A:G,7,0))","v":0},0]
{"$rows_left_out":200}
{"sheet":"Growth Data","index":1,"n_rows":42,"n_cols":12,"rows_kept":42,"cut":false,"hidden":true,"merged":[]}
[1,2,3,4,5,6,7,8,9,10,11,12]
[null,null,null,null,null,"2017-18",null,"2018-19","2018-19","2019-20"]
["DfE","School Name","2018-19","2019-20","2020-21","Lower","Higher","Lower","Higher","Lower","Higher"]
[8862009,"Northdown Primary School","Yes","No","No",45,60]
[8862019,"Chantry Community Academy","Yes","Yes","No",46,60,33,60]
[8862024,"Copperfield Academy","No","Yes","Yes",null,null,83,90,60,90]
[8862028,"Cliftonville Primary School","Yes","Yes","Yes",90,120,90,120,91,120]
[8862034,"Thistle Hill Academy","Yes","Yes","Yes",30,60,30,60,37,60]
[8862036,"Valley Invicta Primary School at Leybourne Chase","Yes","Yes","Yes",16,30,16,30,16,30]
[8862037,"Valley Invicta Primary School at Holborough Lakes","Yes","Yes","Yes",15,30,14,30,15,30]
{"$rows_left_out":33}
{"sheet":"Contents","index":2,"n_rows":8,"n_cols":12,"rows_kept":8,"cut":false,"hidden":false,"merged":[[6,1,6,11],[3,1,3,11],[4,1,4,11],[5,1,5,11],[0,0,1,11],[2,0,2,11]]}
["Contents"]
[]
["Guidance has been written to aid the user in populating this template, to access this guidance click on this link\nUser guidance"]
["Early Years","This is the input sheet to calculate your Early Years 3 & 4 years olds free entitlement, Early Years Pupil Premium and 2 Year old funding, Special Education Needs Inclusion Fund (SENIF) and Disability Access Fund (DAF). Please note that the funding rates are compliant with Dedicated School Grant Financial year that runs from April 2018 to March 2019."]
["High Needs Mainstream","The purpose of this template is to calculate your High Needs mainstream funding for 2018-19. Please note that the funding rates are compliant with Dedicated School Grant Financial year that runs from April 2018 to March 2019."]
["Specialist Resource Provision","The purpose of this template is to calculate your Specialist Resource Provision (SRP) Funding for 2018-19. We have not extended the forecast period in the same way as Early Years and Mainstream High Needs due to complications around place funding. Academies will therefore need to do their own calculations to estimate funding for the period April 2019 to August 2019."]
["Growth Funding ","Funding information will only appear on this template for those Academies entitled to Rising Roll funding. Academies entitled to re-organisation funding will be notified by email."]
[null,null,null,null,null,null,null,null,null,null,null,"V2"]

{"sheet":"Data","index":3,"n_rows":235,"n_cols":25,"rows_kept":235,"cut":false,"hidden":true,"merged":[]}
[1,2,3,4,5,6,7,8,9,10,11,12,13,14,15,16,17,18,19,20,21,22,23,24,25]
[]
["DfE","School name","Base rate","Qualified Teacher Supplement","Disadvantage supplement","IDACI","Ever6 FSM","Low Cost, high Incidence SEN","English as an additional language","Element of Lump Sum","London Fringe Multiplier","des1pre £","des1post£","des2pre£","des2post£","summerpreplace","summerpostplace","winterpreplace","winterpostplace","EFA summerpreplace","EFA summerpostplace","EFA winterpreplace","EFA winterpostplace","Phase","Growth"]
[2001,"Horizon Primary Academy",null,null,null,58360.240800000058,23937.820427969542,32209.136202345006,1811.1059442857099,6235,3.6399999999999988E-2,null,null,null,null,null,null,null,null,null,null,null,null,1,0]
[2003,"Oaks Primary Academy",4,0.9,0,48026.817311602194,17680.380881491525,41201.371378052412,3630.7615625806416,6235,0,null,null,null,null,null,null,null,null,null,null,null,null,1,0]
[2004,"Tree Tops Primary Academy",4,0.9,0.63690505202894754,82096.607600000018,35493.023299499997,70290.565588338548,13335.433199523841,6235,0,null,null,null,null,null,null,null,null,null,null,null,null,1,0]
[2006,"St James the Great Academy",4,0.9,0.13153473900597829,55738.433000000005,21247.175866271187,45463.787278876727,1827.16896818182,6235,0,null,null,null,null,null,null,null,null,null,null,null,null,1,0]
[2007,"Molehill Primary Academy",null,null,null,75341.950099999987,34829.573729684213,75282.24365221757,10319.990883750001,6235,0,1023.2400876057736,null,null,null,{"$f":"VLOOKUP(A8,'SRP Rates'!C:K,4,FALSE)","v":4},null,{"$f":"VLOOKUP(A8,'SRP Rates'!C:K,6,FALSE)","v":4},null,null,null,null,null,1,0]
[2008,"Tiger Primary School",null,null,null,52733.715126116789,17424.44236974018,46219.301368970082,13846.553055898587,6235,0,null,null,null,null,null,null,null,null,null,null,null,null,1,0]
[2009,"Northdown Primary School",4,0.9,0.68536521903115011,158269.13040000011,49195.682155313516,99034.377171094762,19713.195374834391,6235,0,null,null,null,null,null,null,null,null,null,null,null,null,1,17122.88]
{"$rows_left_out":226}
{"sheet":"Home","index":4,"n_rows":20,"n_cols":6,"rows_kept":20,"cut":false,"hidden":false,"merged":[]}
[]
[]
[]
[]
[]
[]
[]
[]
[null,null,null,null,null,{"$f":"IF(dfenum<1,\"Please select your DFE number to begin…\",\"\")","v":"Please select your DFE number to begin…"}]
[]
{"$rows_left_out":11}
{"sheet":"Place Plus","index":5,"n_rows":91,"n_cols":53,"rows_kept":91,"cut":false,"hidden":true,"merged":[[14,26,14,38],[14,40,14,52],[57,2,57,8],[57,12,57,24],[57,26,57,38],[57,40,57,52],[53,2,53,8],[54,2,54,8],[55,2,55,8],[3,3,3,10],[11,2,11,8],[52,2,52,8],[14,2,14,8],[14,12,14,24],[12,2,12,8],[4,3,4,10]]}
[null,null,null,null,null,null,null,null,null,null,null,null,"Notional SEN budget top up rate working"]
[null,null,null,{"$f":"dfenum","v":0}]
[null,null,null,null,null,null,null,null,null,null,null,null,"Notional AEN/SEN Budget"]
[null,null,null,{"$f":"academyname","v":""},null,null,null,null,null,null,null,null,null,null,null,"IDACI",null,null,{"$f":"IF(ISERROR(VLOOKUP(dfenum,data,6,0)),0,VLOOKUP(dfenum,data,6,0))","v":0}]
[null,null,null,"2015/16",null,null,null,null,null,null,null,null,null,null,null,"Looked After Children",null,null,{"$f":"IF(ISERROR(VLOOKUP(dfenum,data,7,0)),0,VLOOKUP(dfenum,data,7,0))","v":0}]
[null,null,null,null,null,null,null,null,null,null,null,null,null,null,null,"Low Cost, high Incidence SEN",null,null,{"$f":"IF(ISERROR(VLOOKUP(dfenum,data,8,0)),0,VLOOKUP(dfenum,data,8,0))","v":0}]
[null,null,null,null,null,null,null,null,null,null,null,null,null,null,null,"English as an additional language",null,null,{"$f":"IF(ISERROR(VLOOKUP(dfenum,data,9,0)),0,VLOOKUP(dfenum,data,9,0))","v":0}]
[null,null,null,null,null,null,null,null,null,null,null,null,null,null,null,"Element of Lump Sum",null,null,{"$f":"IF(ISERROR(VLOOKUP(dfenum,data,10,0)),0,VLOOKUP(dfenum,data,10,0))","v":0}]
[null,null,null,null,null,null,null,null,null,null,null,null,null,null,null,"Total (with London Fringe if applicable)",null,null,null,null,{"$f":"IF(ISERROR(VLOOKUP(dfenum,data,11,0)),0,VLOOKUP(dfenum,data,11,0))","v":0}]
[null,null,null,null,null,null,null,null,null,null,null,null,"School Contribution per Pre-16 Pupil",null,null,null,null,null,null,null,6000]
{"$rows_left_out":82}
{"sheet":"Early Years","index":6,"n_rows":143,"n_cols":6,"rows_kept":143,"cut":false,"hidden":false,"merged":[[8,4,8,5],[9,4,9,5],[10,4,10,5],[11,4,11,5],[4,1,4,5],[6,1,6,5],[72,2,72,4],[72,8,72,10],[104,1,104,3],[106,2,106,4],[12,4,12,5],[16,1,16,3],[17,2,17,4],[17,8,17,10],[70,1,70,4],[136,2,136,4],[136,5,136,7],[136,8,136,10],[137,2,137,4],[137,5,137,7],[137,8,137,10],[138,2,138,4],[138,5,138,7],[138,8,138,10],[140,1,140,4],[142,1,142,4]]}
[]
[null,null,null,null,null,{"$f":"dfenum","v":0}]
[]
[]
[null,{"$f":"Home!B13","v":""}]
[]
[null,"2018/19 Early Years Budget Estimation"]
[]
[null,"Hourly Rate",null,null,"Hourly rate"]
[null,"Base rate",null,null,{"$f":"IFERROR(VLOOKUP(dfenum,data,3,0),0)","v":0}]
{"$rows_left_out":134}
{"sheet":"High Needs Mainstream","index":7,"n_rows":85,"n_cols":111,"rows_kept":85,"cut":false,"hidden":false,"merged":[[14,72,14,74],[3,3,3,13],[4,3,4,13],[9,29,9,40],[9,72,9,74],[11,2,11,10],[12,2,12,10],[14,2,14,13],[14,15,14,27],[14,29,14,41],[14,43,14,55],[15,12,15,13],[16,12,16,13],[17,12,17,13],[18,12,18,13],[19,12,19,13],[31,12,31,13],[20,12,20,13],[21,12,21,13],[22,12,22,13],[23,12,23,13],[24,12,24,13],[25,12,25,13],[26,12,26,13],[27,12,27,13],[28,12,28,13],[29,12,29,13],[30,12,30,13],[43,12,43,13],[32,12,32,13],[33,12,33,13],[34,12,34,13],[35,12,35,13],[36,12,36,13],[37,12,37,13],[38,12,38,13],[39,12,39,13],[40,12,40,13],[41,12,41,13],[42,12,42,13],[55,12,55,13],[44,12,44,13],[45,12,45,13],[46,12,46,13],[47,12,47,13],[48,12,48,13],[49,12,49,13],[50,12,50,13],[51,12,51,13],[52,12,52,13],[53,12,53,13],[54,12,54,13],[67,12,67,13],[56,12,56,13],[57,12,57,13],[58,12,58,13],[59,12,59,13],[60,12,60,13],[61,12,61,13],[62,12,62,13],[63,12,63,13],[64,12,64,13],[65,12,65,13],[66,12,66,13],[79,12,79,13],[68,12,68,13],[69,12,69,13],[70,12,70,13],[71,12,71,13],[72,12,72,13],[73,12,73,13],[74,12,74,13],[75,12,75,13],[76,12,76,13],[77,12,77,13],[78,12,78,13],[87,2,87,10],[87,15,87,27],[87,29,87,41],[87,43,87,55],[80,12,80,13],[82,2,82,10],[82,12,82,13],[83,2,83,10],[84,2,84,10],[85,2,85,10]]}
[null,null,null,null,null,null,null,null,null,null,null,null,null,null,null,"Notional SEN budget top up rate working"]
[null,null,null,{"$f":"dfenum","v":0},null,null,null,null,null,null,null,null,null,null,null,"Notional AEN/SEN Budget"]
[null,null,null,null,null,null,null,null,null,null,null,null,null,null,null,null,null,null,"IDACI",null,null,{"$f":"IF(ISERROR(VLOOKUP(dfenum,Data!A:X,6,0)),0,VLOOKUP(dfenum,Data!A:X,6,0))","v":0}]
[null,null,null,{"$f":"Home!B13","v":""},null,null,null,null,null,null,null,null,null,null,null,null,null,null,"Ever 6 FSM",null,null,{"$f":"IF(ISERROR(VLOOKUP(dfenum,Data!A:X,7,0)),0,VLOOKUP(dfenum,Data!A:X,7,0))","v":0}]
[null,null,null,"2018/19",null,null,null,null,null,null,null,null,null,null,null,null,null,null,"Low Cost, high Incidence SEN",null,null,{"$f":"IF(ISERROR(VLOOKUP(dfenum,Data!A:X,8,0)),0,VLOOKUP(dfenum,Data!A:X,8,0))","v":0}]
[null,null,null,null,null,null,null,null,null,null,null,null,null,null,null,null,null,null,"English as an additional language",null,null,{"$f":"IF(ISERROR(VLOOKUP(dfenum,Data!A:X,9,0)),0,VLOOKUP(dfenum,Data!A:X,9,0))","v":0}]
[null,null,null,null,null,null,null,null,null,null,null,null,null,null,null,null,null,null,"Element of Lump Sum",null,null,{"$f":"IF(ISERROR(VLOOKUP(dfenum,Data!A:X,10,0)),0,VLOOKUP(dfenum,Data!A:X,10,0))","v":0}]
[null,null,null,null,null,null,null,null,null,null,null,null,null,null,null,null,null,null,"Area Cost Adjustment-London Fringe",null,null,{"$f":"IFERROR(VLOOKUP(dfenum,Data!A4:K400,11,0),0)*SUM(V3:V7)","v":0}]
[null,null,null,null,null,null,null,null,null,null,null,null,null,null,null,null,null,null,"Total (with Area Cost Adjustment if applicable)",null,null,null,null,{"$f":"SUM(V3:V8)","v":0}]
[null,null,null,null,null,null,null,null,null,null,null,null,null,null,null,"School Contribution per Pre-16 Pupil",null,null,null,null,null,null,null,6000,null,null,null,null,null,"Extra top up due to 28% rule"]
{"$rows_left_out":76}
{"sheet":"Specialist Resourced Provision","index":8,"n_rows":180,"n_cols":33,"rows_kept":180,"cut":false,"hidden":false,"merged":[[29,1,30,1],[15,4,15,5],[16,4,16,5],[17,4,17,5],[20,4,20,5],[21,4,21,5],[29,3,31,5],[26,4,28,5],[5,2,5,8],[7,2,7,8],[11,1,12,7],[16,1,17,1],[20,1,21,1],[13,1,13,2],[33,4,33,5],[34,4,34,5],[33,1,34,1],[44,1,46,8],[47,3,48,3]]}
[]
[null,null,null,null,null,null,null,{"$f":"dfenum","v":0}]
[]
[]
[]
[null,null,{"$f":"academyname","v":""}]
[]
[null,null,"High Needs funding in a Specialist Resourced Provision (SRP) - Place Plus "]
[]
[null,"2018/19 Place Funding",null,null,null,null,null,null,null,null,"2018/19 Element 3 Input (top-up funding)"]
{"$rows_left_out":171}
{"sheet":"Growth Funding","index":9,"n_rows":29,"n_cols":7,"rows_kept":29,"cut":false,"hidden":false,"merged":[[6,1,6,6],[8,1,8,6]]}
[null,null,null,null,null,null,{"$f":"dfenum","v":0}]
[]
[]
[]
[]
[]
[null,{"$f":"academyname","v":""}]
[]
[null,"Growth Funding Estimator"]
[]
{"$rows_left_out":20}
{"sheet":"SRP Rates","index":10,"n_rows":64,"n_cols":51,"rows_kept":64,"cut":false,"hidden":false,"merged":[[1,22,1,26],[1,28,1,39],[1,41,1,48],[3,17,4,20],[4,5,4,6],[4,7,4,8],[4,9,4,10],[1,5,1,10],[1,12,1,20]]}
["How your SRP rate was calculated…",null,null,null,null,"Step 1",null,null,null,null,null,null,"Step 2",null,null,null,null,null,null,null,null,null,"Step 3",null,null,null,null,null,"Step 4",null,null,null,null,null,null,null,null,null,null,null,null,"Step 4"]
[null,null,null,null,null,"First of all we need to establish the commissioned place numbers pre and post 16 in both relevant academic years and the weighted average number of places in the financial year.",null,null,null,null,null,null,"The first part of your SRP rate is based on the rates previously known as Individually assigned resources (IAR). There are four rates based on the need type of the pupil, so we need to establish the mix of needs types at your school and allocate your places using this mix.",null,null,null,null,null,null,null,null,null,"Now that we have established the mix to be used, we can work out the total amount of cash that your number of places should attract if you are exactly at capacity. Then work out the average per place and feed it into your SRP rate.",null,null,null,null,null,null,null,null,null,null,null,null,null,null,null,null,null,null,"Finally we can now bring everything together to find your SRP rate. The rate is only the IAR element as these pupils also attract funding through either the schools formula budget or the 16-19 allocations. From the total rate we deduct £6,000 element 2 to reach the element 3 rate.\nPre 16 E3 Rate = IAR Element - E2 (£6,000)\nPost 16 E3 Rate = IAR Element - E2 (£6,000)"]
[null,null,null,null,null,null,null,null,null,null,null,null,null,null,null,null,null,null,null,null,null,null,14551.228288451965,19028.881051269283,10653.095777084111,12602.662032768039,"1-3"]
[null,null,null,null,null,"Place Numbers",null,null,null,null,null,null,"Actual pupils in October 2017 census",null,null,null,null,"Spread of commissioned places with October mix",null,null,null,null,14051.228288451965,16028.881051269283,8653.0957770841123,10602.662032768039,"4-20"]
[null,null,null,null,null,"2017/18 Academic",null,"2018/19 Academic",null,"2018/19 Financial",null,null,null,null,null,null,null,null,null,null,null,null,12551.228288451965,15028.881051269283,6653.0957770841123,8602.6620327680394,"20+"]
[null,null,"DFE","School",null,"Pre 16","Post 16","Pre 16","Post 16","Pre 16","Post 16",null,"ASD","PD, HI & VI","SLCN & SPLD","SLD",null,"ASD","PD, HI & VI","SLCN & SPLD","SLD",null,"ASD","PD, HI & VI","SLCN & SPLD","SLD","Average £",null,"AWPU Primary","AWPU KS3","AWPU KS4","FSM","IDACI","LAC","EAL","Prior Attainment","London Fringe","Total","NOR","Average £",null,"Pre-16 total rate","Post-16 total rate",null,"Element 1 pre-16","Element 1 post-16","Element 2 all ages","Element 3 pre-16","Element 3 post-16","Element 3 pre-16\n(Monthly)","Element 3 post-16\n(Monthly)"]
[null,2155,2155,"Slade Primary School",null,5,0,5,0,5,0,null,0,6,0,0,null,{"$f":"(M7/SUM($M7:$P7))*($J7+$K7)","v":0},{"$f":"(N7/SUM($M7:$P7))*($J7+$K7)","v":5},{"$f":"(O7/SUM($M7:$P7))*($J7+$K7)","v":0},0,null,{"$f":"IF(R7>20,(3*W$3)+(17*W$4)+((R7-20)*W$5),\nIF(R7>3,(3*W$3)+((R7-3)*W$4),\nR7*W$3))","v":0},89144.405256346421,0,0,{"$f":"SUM(W7:Z7)/SUM(R7:U7)","v":17828.881051269283},null,null,null,null,null,null,null,null,null,null,null,null,null,null,{"$f":"AA7+AN7","v":17828.881051269283},{"$f":"IF(K7>0,AA7,0)","v":0},null,"Included in the Schools Formula Budget","Included in 16-19 allocation",6000,{"$f":"AP7-AU7","v":11828.881051269283},{"$f":"IF(AQ7-AU7<0,0,AQ7-AU7)","v":0},{"$f":"AV7/12","v":985.74008760577362},0]
[null,2312,2312,"River Primary School",null,12,0,12,0,12,0,null,0,0,10,0,null,0,0,12,0,null,0,0,109837.14932500935,0,9153.0957770841123,null,null,null,null,null,null,null,null,null,null,null,null,null,null,9153.0957770841123,0,null,"Included in the Schools Formula Budget","Included in 16-19 allocation",6000,{"$f":"AP8-AU8","v":3153.0957770841123},0,262.75798142367603,0]
[null,2434,2434,"West Minster Primary",null,12,0,12,0,12,0,null,0,0,12,0,null,0,0,12,0,null,0,0,109837.14932500935,0,9153.0957770841123,null,null,null,null,null,null,null,null,null,null,null,null,null,null,9153.0957770841123,0,null,"Included in the Schools Formula Budget","Included in 16-19 allocation",6000,3153.0957770841123,0,262.75798142367603,0]
[null,2490,2490,"Bishops Down Primary School",null,5,0,7,0,6.1666666666666679,0,null,0,9,0,0,null,0,6.1666666666666679,0,0,null,0,107844.76648282725,0,0,17488.34051072874,null,null,null,null,null,null,null,null,null,null,null,null,null,null,17488.34051072874,0,null,"Included in the Schools Formula Budget","Included in 16-19 allocation",6000,11488.34051072874,0,957.36170922739495,0]
{"$rows_left_out":54}